null
SMILES: COc1ccc(cc1OC)C1=C(C(=O)N(C(=O)c2cc(Br)c(OCc3ccccc3)cc2OCCO)C1=O)c1ccc(OC)c(OC)c1
InChI Key: InChIKey=GCHHRSTVQGCNFS-UHFFFAOYSA-N
Activity Spreadsheet -- Enzyme Inhibition Constant Data from BindingDB
Found 1 hit for monomerid = 50109278
Trg + Lig
Ki
nM
ΔG°
kcal/mole
IC50
nM
Kd
nM
EC50/IC50
nM
koff
s-1
kon
M-1s-1
pHTemp
°C
ATP-dependent translocase ABCB1
(Homo sapiens (Human))
BDBM50109278
(CHEMBL3601685)
Show SMILES COc1ccc(cc1OC)C1=C(C(=O)N(C(=O)c2cc(Br)c(OCc3ccccc3)cc2OCCO)C1=O)c1ccc(OC)c(OC)c1 |t:11|
Show InChI InChI=1S/C36H32BrNO10/c1-43-26-12-10-22(16-30(26)45-3)32-33(23-11-13-27(44-2)31(17-23)46-4)36(42)38(35(32)41)34(40)24-18-25(37)29(19-28(24)47-15-14-39)48-20-21-8-6-5-7-9-21/h5-13,16-19,39H,14-15,20H2,1-4H3
n/an/a 6.5n/an/an/an/an/an/a
Ocean University of China
Curated by ChEMBL
Assay Description
Modulation of P-gp (unknown origin) transfected in human MDA435/LCC6MDR cells assessed as paclitaxel IC50 for cell growth inhibition at 1 uM after 5 ...
Bioorg Med Chem 23: 5566-73 (2015)
BindingDB Entry DOI: 10.7270/Q2WS8W29