BDBM50109427 CHEMBL3601109
SMILES: CNC(=O)Cn1cc(Nc2ncc(Cl)c(NCc3cccc(NC(=O)C=C)c3)n2)cn1
InChI Key: InChIKey=LGZQGMCNBJXRSZ-UHFFFAOYSA-N
Data: 1 IC50
Activity Spreadsheet -- Enzyme Inhibition Constant Data from BindingDB
Found 1 hit for monomerid = 50109427
Trg + Lig
Ki
nM
ΔG°
kcal/mole
IC50
nM
Kd
nM
EC50/IC50
nM
koff
s-1
kon
M-1s-1
pHTemp
°C
Tyrosine-protein kinase JAK3
(Homo sapiens (Human))
BDBM50109427
(CHEMBL3601109)
Show SMILES CNC(=O)Cn1cc(Nc2ncc(Cl)c(NCc3cccc(NC(=O)C=C)c3)n2)cn1
Show InChI InChI=1S/C20H21ClN8O2/c1-3-17(30)26-14-6-4-5-13(7-14)8-23-19-16(21)10-24-20(28-19)27-15-9-25-29(11-15)12-18(31)22-2/h3-7,9-11H,1,8,12H2,2H3,(H,22,31)(H,26,30)(H2,23,24,27,28)
Reactome pathway
n/an/a<0.5n/an/an/an/an/an/a
Harvard Medical School
Curated by ChEMBL
Assay Description
Inhibition of JAK3 (unknown origin) by Z'-Lyte assay
J Med Chem 58: 6589-606 (2015)
BindingDB Entry DOI: 10.7270/Q2833TSH