BDBM50109499 CHEMBL3601127
SMILES: Cn1cc(Nc2ncc(Cl)c(NCc3ccc(F)c(NC(=O)C=C)c3)n2)cn1
InChI Key: InChIKey=JQWOFXRFUGIYCB-UHFFFAOYSA-N
Data: 1 IC50
Activity Spreadsheet -- Enzyme Inhibition Constant Data from BindingDB
Found 1 hit for monomerid = 50109499
Trg + Lig
Ki
nM
ΔG°
kcal/mole
IC50
nM
Kd
nM
EC50/IC50
nM
koff
s-1
kon
M-1s-1
pHTemp
°C
Tyrosine-protein kinase JAK3
(Homo sapiens (Human))
BDBM50109499
(CHEMBL3601127)
Show SMILES Cn1cc(Nc2ncc(Cl)c(NCc3ccc(F)c(NC(=O)C=C)c3)n2)cn1
Show InChI InChI=1S/C18H17ClFN7O/c1-3-16(28)25-15-6-11(4-5-14(15)20)7-21-17-13(19)9-22-18(26-17)24-12-8-23-27(2)10-12/h3-6,8-10H,1,7H2,2H3,(H,25,28)(H2,21,22,24,26)
Reactome pathway
n/an/a 4.40n/an/an/an/an/an/a
Harvard Medical School
Curated by ChEMBL
Assay Description
Inhibition of JAK3 (unknown origin) by Z'-Lyte assay
J Med Chem 58: 6589-606 (2015)
BindingDB Entry DOI: 10.7270/Q2833TSH