BDBM50109515 CHEMBL3601719
SMILES: COc1cc(ccc1Nc1ncc(OC)c(NCc2cccc(NC(=O)C=C)c2)n1)N1CCN(C)CC1
InChI Key: InChIKey=XONBNOLYXWAWMY-UHFFFAOYSA-N
Data: 1 IC50
Activity Spreadsheet -- Enzyme Inhibition Constant Data from BindingDB
Found 1 hit for monomerid = 50109515
Trg + Lig
Ki
nM
ΔG°
kcal/mole
IC50
nM
Kd
nM
EC50/IC50
nM
koff
s-1
kon
M-1s-1
pHTemp
°C
Tyrosine-protein kinase JAK3
(Homo sapiens (Human))
BDBM50109515
(CHEMBL3601719)
Show SMILES COc1cc(ccc1Nc1ncc(OC)c(NCc2cccc(NC(=O)C=C)c2)n1)N1CCN(C)CC1
Show InChI InChI=1S/C27H33N7O3/c1-5-25(35)30-20-8-6-7-19(15-20)17-28-26-24(37-4)18-29-27(32-26)31-22-10-9-21(16-23(22)36-3)34-13-11-33(2)12-14-34/h5-10,15-16,18H,1,11-14,17H2,2-4H3,(H,30,35)(H2,28,29,31,32)
Reactome pathway
n/an/a 31n/an/an/an/an/an/a
Harvard Medical School
Curated by ChEMBL
Assay Description
Inhibition of JAK3 (unknown origin) by Z'-Lyte assay
J Med Chem 58: 6589-606 (2015)
BindingDB Entry DOI: 10.7270/Q2833TSH