BDBM50109809 3-[2-(6,7-Dimethoxy-3,4-dihydro-1H-isoquinolin-2-yl)-ethyl]-2-naphthalen-2-yl-3H-quinazolin-4-one::CHEMBL435437
SMILES: COc1cc2CCN(CCn3c(nc4ccccc4c3=O)-c3ccc4ccccc4c3)Cc2cc1OC
InChI Key: InChIKey=TYAZKPZMWXPZFC-UHFFFAOYSA-N
Data: 2 IC50
Activity Spreadsheet -- Enzyme Inhibition Constant Data from BindingDB
Found 2 hits for monomerid = 50109809
Trg + Lig
Ki
nM
ΔG°
kcal/mole
IC50
nM
Kd
nM
EC50/IC50
nM
koff
s-1
kon
M-1s-1
pHTemp
°C
P-glycoprotein 1 and 3 (MDR1a/MDR1b)
(Mus musculus)
BDBM50109809
(3-[2-(6,7-Dimethoxy-3,4-dihydro-1H-isoquinolin-2-y...)
Show SMILES COc1cc2CCN(CCn3c(nc4ccccc4c3=O)-c3ccc4ccccc4c3)Cc2cc1OC
Show InChI InChI=1S/C31H29N3O3/c1-36-28-18-23-13-14-33(20-25(23)19-29(28)37-2)15-16-34-30(32-27-10-6-5-9-26(27)31(34)35)24-12-11-21-7-3-4-8-22(21)17-24/h3-12,17-19H,13-16,20H2,1-2H3
Reactome pathway
n/an/a 850n/an/an/an/an/an/a
Xenova Ltd.
Curated by ChEMBL
Assay Description
Inhibitory activity against P-glyco-protein (Pgp) using accumulation assay for Pgp expressing EMT6/AR1.0 cells.
Bioorg Med Chem Lett 12: 571-4 (2002)
BindingDB Entry DOI: 10.7270/Q2PV6JP9
Multidrug resistance protein 1/Multidrug resistance associated protein 1
(Homo sapiens (Human))
BDBM50109809
(3-[2-(6,7-Dimethoxy-3,4-dihydro-1H-isoquinolin-2-y...)
Show SMILES COc1cc2CCN(CCn3c(nc4ccccc4c3=O)-c3ccc4ccccc4c3)Cc2cc1OC
Show InChI InChI=1S/C31H29N3O3/c1-36-28-18-23-13-14-33(20-25(23)19-29(28)37-2)15-16-34-30(32-27-10-6-5-9-26(27)31(34)35)24-12-11-21-7-3-4-8-22(21)17-24/h3-12,17-19H,13-16,20H2,1-2H3
n/an/a 900n/an/an/an/an/an/a
Xenova Ltd.
Curated by ChEMBL
Assay Description
Inhibition of multidrug resistance associated protein type 1 (MRP1) assayed by an accumulation assay in COR.L23/R cells
Bioorg Med Chem Lett 12: 571-4 (2002)
BindingDB Entry DOI: 10.7270/Q2PV6JP9