BDBM50110000 (S)-N-[(S)-1-((S)-1-{(S)-1-[(S)-1-((S)-1-Aminooxalyl-pentylcarbamoyl)-3-methyl-butylcarbamoyl]-2,2-dimethyl-propylcarbamoyl}-2-o-tolyl-ethylcarbamoyl)-2-methyl-propyl]-3-(3-carboxy-propionylamino)-succinamic acid::CHEMBL348546
SMILES: CCCC[C@H](NC(=O)[C@H](CC(C)C)NC(=O)[C@@H](NC(=O)[C@H](Cc1ccccc1C)NC(=O)[C@@H](NC(=O)[C@H](CC(O)=O)NC(=O)CCC(O)=O)C(C)C)C(C)(C)C)C(=O)C(N)=O
InChI Key: InChIKey=DFAPYLPCDVEGAM-RYPHLYRRSA-N
Data: 1 IC50
Activity Spreadsheet -- Enzyme Inhibition Constant Data from BindingDB
Found 1 hit for monomerid = 50110000
Trg + Lig
Ki
nM
ΔG°
kcal/mole
IC50
nM
Kd
nM
EC50/IC50
nM
koff
s-1
kon
M-1s-1
pHTemp
°C
Hepatitis C virus serine protease, NS3/NS4A
(Hepatitis C virus)
BDBM50110000
((S)-N-[(S)-1-((S)-1-{(S)-1-[(S)-1-((S)-1-Aminooxal...)
Show SMILES CCCC[C@H](NC(=O)[C@H](CC(C)C)NC(=O)[C@@H](NC(=O)[C@H](Cc1ccccc1C)NC(=O)[C@@H](NC(=O)[C@H](CC(O)=O)NC(=O)CCC(O)=O)C(C)C)C(C)(C)C)C(=O)C(N)=O
Show InChI InChI=1S/C42H65N7O12/c1-10-11-16-26(34(55)36(43)56)45-37(57)27(19-22(2)3)47-41(61)35(42(7,8)9)49-39(59)28(20-25-15-13-12-14-24(25)6)46-40(60)33(23(4)5)48-38(58)29(21-32(53)54)44-30(50)17-18-31(51)52/h12-15,22-23,26-29,33,35H,10-11,16-21H2,1-9H3,(H2,43,56)(H,44,50)(H,45,57)(H,46,60)(H,47,61)(H,48,58)(H,49,59)(H,51,52)(H,53,54)/t26-,27-,28-,29-,33-,35+/m0/s1
n/an/a 20n/an/an/an/an/an/a
Roche Discovery Welwyn
Curated by ChEMBL
Assay Description
Inhibitory concentration of the compound against Hepatitis C virus NS3 proteinase
Bioorg Med Chem Lett 12: 641-3 (2002)
BindingDB Entry DOI: 10.7270/Q2SN089N