BDBM50110365 CHEMBL3605448
SMILES: CC(c1cnn(C)c1)n1c(C)c(C(=O)NCc2c(C)cc(C)[nH]c2=O)c2ccccc12
InChI Key:
Data: 2 IC50
Activity Spreadsheet -- Enzyme Inhibition Constant Data from BindingDB
Found 2 hits for monomerid = 50110365
Trg + Lig
Ki
nM
ΔG°
kcal/mole
IC50
nM
Kd
nM
EC50/IC50
nM
koff
s-1
kon
M-1s-1
pHTemp
°C
Histone-lysine N-methyltransferase EZH2
(Homo sapiens (Human))
BDBM50110365
(CHEMBL3605448)
Show SMILES CC(c1cnn(C)c1)n1c(C)c(C(=O)NCc2c(C)cc(C)[nH]c2=O)c2ccccc12
n/an/a 73n/an/an/an/an/an/a
Constellation Pharmaceuticals, Inc.
Curated by ChEMBL
Assay Description
Inhibition of EZH2 (unknown origin) using biotinylated nucleosome, H3K27me3 activator and [3H]-SAM incubated for 60 mins by top-count based method
Bioorg Med Chem Lett 25: 3644-9 (2015)
BindingDB Entry DOI: 10.7270/Q2Q24205
Histone-lysine N-methyltransferase EZH2
(Homo sapiens (Human))
BDBM50110365
(CHEMBL3605448)
Show SMILES CC(c1cnn(C)c1)n1c(C)c(C(=O)NCc2c(C)cc(C)[nH]c2=O)c2ccccc12
n/an/a 388n/an/an/an/an/an/a
Constellation Pharmaceuticals, Inc.
Curated by ChEMBL
Assay Description
Inhibition of EZH2 Y641N mutant (unknown origin) using biotinylated nucleosome, H3K27me3 activator and [3H]-SAM incubated for 60 mins by top-count ba...
Bioorg Med Chem Lett 25: 3644-9 (2015)
BindingDB Entry DOI: 10.7270/Q2Q24205