BDBM50110490 CHEMBL3605812
SMILES: Cc1ccc(cc1)-c1c[nH]c(n1)C1(CCCC1)NCC1CCCCC1
InChI Key: InChIKey=HVFARNUHQAWEEP-UHFFFAOYSA-N
Data: 1 KI  1 EC50
Activity Spreadsheet -- Enzyme Inhibition Constant Data from BindingDB
Found 2 hits for monomerid = 50110490
Trg + Lig
Ki
nM
ΔG°
kcal/mole
IC50
nM
Kd
nM
EC50/IC50
nM
koff
s-1
kon
M-1s-1
pHTemp
°C
Somatostatin receptor type 3
(Homo sapiens (Human))
BDBM50110490
(CHEMBL3605812)
Show SMILES Cc1ccc(cc1)-c1c[nH]c(n1)C1(CCCC1)NCC1CCCCC1
Show InChI InChI=1S/C22H31N3/c1-17-9-11-19(12-10-17)20-16-23-21(25-20)22(13-5-6-14-22)24-15-18-7-3-2-4-8-18/h9-12,16,18,24H,2-8,13-15H2,1H3,(H,23,25)
Reactome pathway
27n/an/an/an/an/an/an/an/a
Merck Research Laboratories
Curated by ChEMBL
Assay Description
Displacement of [125I]SS-14 from human SSTR3 expressed in CHO cells after 60 to 90 mins
Bioorg Med Chem Lett 25: 3520-5 (2015)
BindingDB Entry DOI: 10.7270/Q29W0H9M
Somatostatin receptor type 3
(Homo sapiens (Human))
BDBM50110490
(CHEMBL3605812)
Show SMILES Cc1ccc(cc1)-c1c[nH]c(n1)C1(CCCC1)NCC1CCCCC1
Show InChI InChI=1S/C22H31N3/c1-17-9-11-19(12-10-17)20-16-23-21(25-20)22(13-5-6-14-22)24-15-18-7-3-2-4-8-18/h9-12,16,18,24H,2-8,13-15H2,1H3,(H,23,25)
Reactome pathway
n/an/an/an/a 34n/an/an/an/a
Merck Research Laboratories
Curated by ChEMBL
Assay Description
Agonist activity at human SSTR3 expressed in CHO cells assessed as intracellular cAMP level after 45 mins by time-resolved fluorescence assay
Bioorg Med Chem Lett 25: 3520-5 (2015)
BindingDB Entry DOI: 10.7270/Q29W0H9M