BDBM50110684 CHEMBL3605825
SMILES: CCCOc1cc(F)ccc1NS(=O)(=O)c1ccc2CN(Cc2c1)C(=O)Nc1ccc(cc1)C(C)(C)C
InChI Key: InChIKey=BPHOUHRRPZERQI-UHFFFAOYSA-N
Data: 1 IC50
Activity Spreadsheet -- Enzyme Inhibition Constant Data from BindingDB
Found 1 hit for monomerid = 50110684
Trg + Lig
Ki
nM
ΔG°
kcal/mole
IC50
nM
Kd
nM
EC50/IC50
nM
koff
s-1
kon
M-1s-1
pHTemp
°C
Acyl-CoA:monoacylglycerol acyltransferase 2 (MOGAT2)
(Homo sapiens (Human))
BDBM50110684
(CHEMBL3605825)
Show SMILES CCCOc1cc(F)ccc1NS(=O)(=O)c1ccc2CN(Cc2c1)C(=O)Nc1ccc(cc1)C(C)(C)C
Show InChI InChI=1S/C28H32FN3O4S/c1-5-14-36-26-16-22(29)9-13-25(26)31-37(34,35)24-12-6-19-17-32(18-20(19)15-24)27(33)30-23-10-7-21(8-11-23)28(2,3)4/h6-13,15-16,31H,5,14,17-18H2,1-4H3,(H,30,33)
n/an/a 2.30E+3n/an/an/an/an/an/a
Taisho Pharmaceutical Co., Ltd
Curated by ChEMBL
Assay Description
Inhibition of human recombinant MGAT2 assessed as reduction in enzyme-mediated deacylation of oleoyl-CoA incubated for 20 mins by CPM dye based fluor...
Bioorg Med Chem 23: 5922-31 (2015)
BindingDB Entry DOI: 10.7270/Q2639RJ6