BDBM50110685 25-Isobutyl-15-(6-methoxy-3,5-dimethyl-7-phenyl-hepta-1,3-dienyl)-3,7,14,18,21-pentamethyl-6-methylene-2,5,8,13,17,20,24-heptaoxo-1,4,7,12,16,19hexaaza-cyclopentacosane-11,22-dicarboxylic acid::CHEMBL17738
SMILES: CO[C@@H](Cc1ccccc1)[C@@H](C)\C=C(/C)\C=C\[C@@H]1NC(=O)[C@H](C)NC(=O)[C@@H](C)[C@@H](CC(=O)[C@H](CC(C)C)NC(=O)[C@@H](C)NC(=O)C(=C)N(C)C(=O)CC[C@@H](NC(=O)[C@H]1C)C(O)=O)C(O)=O
InChI Key: InChIKey=GWYNIYAIEYBZQG-VRRJEYQWSA-N
Data: 1 IC50
Activity Spreadsheet -- Enzyme Inhibition Constant Data from BindingDB
Found 1 hit for monomerid = 50110685
Trg + Lig
Ki
nM
ΔG°
kcal/mole
IC50
nM
Kd
nM
EC50/IC50
nM
koff
s-1
kon
M-1s-1
pHTemp
°C
Serine-threonine protein phosphatase 2A regulatory subunit
(Gallus gallus)
BDBM50110685
(25-Isobutyl-15-(6-methoxy-3,5-dimethyl-7-phenyl-he...)
Show SMILES CO[C@@H](Cc1ccccc1)[C@@H](C)\C=C(/C)\C=C\[C@@H]1NC(=O)[C@H](C)NC(=O)[C@@H](C)[C@@H](CC(=O)[C@H](CC(C)C)NC(=O)[C@@H](C)NC(=O)C(=C)N(C)C(=O)CC[C@@H](NC(=O)[C@H]1C)C(O)=O)C(O)=O
Show InChI InChI=1S/C47H68N6O12/c1-25(2)21-37-38(54)24-34(46(61)62)28(5)41(56)48-30(7)43(58)50-35(18-17-26(3)22-27(4)39(65-11)23-33-15-13-12-14-16-33)29(6)42(57)51-36(47(63)64)19-20-40(55)53(10)32(9)45(60)49-31(8)44(59)52-37/h12-18,22,25,27-31,34-37,39H,9,19-21,23-24H2,1-8,10-11H3,(H,48,56)(H,49,60)(H,50,58)(H,51,57)(H,52,59)(H,61,62)(H,63,64)/b18-17+,26-22+/t27-,28-,29-,30-,31+,34+,35-,36+,37-,39-/m0/s1
n/an/a 0.300n/an/an/an/an/an/a
The University of Newcastle
Curated by ChEMBL
Assay Description
Inhibition of microcystin analogues to catalytic subunits of Serine/threonine protein phosphatase 2A (PP2Ac)
J Med Chem 45: 1151-75 (2002)
BindingDB Entry DOI: 10.7270/Q2DJ5GCG