BDBM50110689 CHEMBL3605822
SMILES: CCc1cc(F)ccc1NS(=O)(=O)c1ccc2CN(Cc2c1)C(=O)Nc1ccc(cc1)C(C)(C)C
InChI Key: InChIKey=MLYLABCLSXJCQN-UHFFFAOYSA-N
Data: 1 IC50
Activity Spreadsheet -- Enzyme Inhibition Constant Data from BindingDB
Found 1 hit for monomerid = 50110689
Trg + Lig
Ki
nM
ΔG°
kcal/mole
IC50
nM
Kd
nM
EC50/IC50
nM
koff
s-1
kon
M-1s-1
pHTemp
°C
Acyl-CoA:monoacylglycerol acyltransferase 2 (MOGAT2)
(Homo sapiens (Human))
BDBM50110689
(CHEMBL3605822)
Show SMILES CCc1cc(F)ccc1NS(=O)(=O)c1ccc2CN(Cc2c1)C(=O)Nc1ccc(cc1)C(C)(C)C
Show InChI InChI=1S/C27H30FN3O3S/c1-5-18-14-22(28)9-13-25(18)30-35(33,34)24-12-6-19-16-31(17-20(19)15-24)26(32)29-23-10-7-21(8-11-23)27(2,3)4/h6-15,30H,5,16-17H2,1-4H3,(H,29,32)
n/an/a 2.49E+3n/an/an/an/an/an/a
Taisho Pharmaceutical Co., Ltd
Curated by ChEMBL
Assay Description
Inhibition of human recombinant MGAT2 assessed as reduction in enzyme-mediated deacylation of oleoyl-CoA incubated for 20 mins by CPM dye based fluor...
Bioorg Med Chem 23: 5922-31 (2015)
BindingDB Entry DOI: 10.7270/Q2639RJ6