BDBM50111298 8-{4-[(7-Benzo[b]thiophen-2-yl-4-hydroxy-2-oxo-1,2-dihydro-quinoline-3-carbonyl)-amino]-phenoxy}-octanoic acid::CHEMBL10181
SMILES: OC(=O)CCCCCCCOc1ccc(NC(=O)c2c(O)c3ccc(cc3[nH]c2=O)-c2cc3ccccc3s2)cc1
InChI Key: InChIKey=GMOUSMQVYSYGJZ-UHFFFAOYSA-N
Data: 1 IC50
Activity Spreadsheet -- Enzyme Inhibition Constant Data from BindingDB
Found 1 hit for monomerid = 50111298
Trg + Lig
Ki
nM
ΔG°
kcal/mole
IC50
nM
Kd
nM
EC50/IC50
nM
koff
s-1
kon
M-1s-1
pHTemp
°C
Plasminogen activator inhibitor-1
(Homo sapiens (Human))
BDBM50111298
(8-{4-[(7-Benzo[b]thiophen-2-yl-4-hydroxy-2-oxo-1,2...)
Show SMILES OC(=O)CCCCCCCOc1ccc(NC(=O)c2c(O)c3ccc(cc3[nH]c2=O)-c2cc3ccccc3s2)cc1
Show InChI InChI=1S/C32H30N2O6S/c35-28(36)10-4-2-1-3-7-17-40-23-14-12-22(13-15-23)33-31(38)29-30(37)24-16-11-21(18-25(24)34-32(29)39)27-19-20-8-5-6-9-26(20)41-27/h5-6,8-9,11-16,18-19H,1-4,7,10,17H2,(H,33,38)(H,35,36)(H2,34,37,39)
Reactome pathway
n/an/a 300n/an/an/an/an/an/a
Xenova Limited
Curated by ChEMBL
Assay Description
Inhibitory activity against human plasminogen activator inhibitor-1(PAI-1) evaluated by chromogenic assay.
Bioorg Med Chem Lett 12: 1063-6 (2002)
BindingDB Entry DOI: 10.7270/Q2W958HQ