null
SMILES: OC(=O)CCN1CCN(CC1)C(=O)N1CCC2(CCN(C2)c2ccncc2)CC1
InChI Key: InChIKey=OABCVZBUDHCWMB-UHFFFAOYSA-N
Activity Spreadsheet -- Enzyme Inhibition Constant Data from BindingDB
Found 1 hit for monomerid = 50111405
Trg + Lig
Ki
nM
ΔG°
kcal/mole
IC50
nM
Kd
nM
EC50/IC50
nM
koff
s-1
kon
M-1s-1
pHTemp
°C
Integrin alpha-IIb/beta-3
(Homo sapiens (Human))
BDBM50111405
(3-[4-(2-Pyridin-4-yl-2,8-diaza-spiro[4.5]decane-8-...)
Show SMILES OC(=O)CCN1CCN(CC1)C(=O)N1CCC2(CCN(C2)c2ccncc2)CC1
Show InChI InChI=1S/C21H31N5O3/c27-19(28)3-9-23-13-15-25(16-14-23)20(29)24-10-4-21(5-11-24)6-12-26(17-21)18-1-7-22-8-2-18/h1-2,7-8H,3-6,9-17H2,(H,27,28)
n/an/a 87n/an/an/an/an/an/a
COR Therapeutics, Inc.
Curated by ChEMBL
Assay Description
In vitro activity to block the binding of fibrinogen to purified human fibrinogen receptor.
Bioorg Med Chem Lett 12: 1103-7 (2002)
BindingDB Entry DOI: 10.7270/Q2H131BN