BDBM50111439 CHEMBL42853::{4-[2-Acetylamino-2-(3-carbamoyl-2-cyclohexylmethoxy-6,7,8,9-tetrahydro-5H-benzocyclohepten-5-ylcarbamoyl)-ethyl]-2-phosphono-phenyl}-phosphonic acid
SMILES: CC(=O)NC(Cc1ccc(c(c1)P(O)(O)=O)P(O)(O)=O)C(=O)N[C@H]1CCCCc2cc(OCC3CCCCC3)c(cc12)C(N)=O
InChI Key: InChIKey=SPSGYTWOIGAABK-SKCDSABHSA-N
Data: 1 IC50
Activity Spreadsheet -- Enzyme Inhibition Constant Data from BindingDB
Found 1 hit for monomerid = 50111439
Trg + Lig
Ki
nM
ΔG°
kcal/mole
IC50
nM
Kd
nM
EC50/IC50
nM
koff
s-1
kon
M-1s-1
pHTemp
°C
Proto-oncogene tyrosine-protein kinase Src
(Homo sapiens (Human))
BDBM50111439
(CHEMBL42853 | {4-[2-Acetylamino-2-(3-carbamoyl-2-c...)
Show SMILES CC(=O)NC(Cc1ccc(c(c1)P(O)(O)=O)P(O)(O)=O)C(=O)N[C@H]1CCCCc2cc(OCC3CCCCC3)c(cc12)C(N)=O
Show InChI InChI=1S/C30H41N3O10P2/c1-18(34)32-25(13-20-11-12-27(44(37,38)39)28(14-20)45(40,41)42)30(36)33-24-10-6-5-9-21-15-26(23(29(31)35)16-22(21)24)43-17-19-7-3-2-4-8-19/h11-12,14-16,19,24-25H,2-10,13,17H2,1H3,(H2,31,35)(H,32,34)(H,33,36)(H2,37,38,39)(H2,40,41,42)/t24-,25?/m0/s1
n/an/a 300n/an/an/an/an/an/a
Pfizer Global Research and Development
Curated by ChEMBL
Assay Description
Inhibition of Src protein tryrosine kinase
J Med Chem 45: 1543-58 (2002)
BindingDB Entry DOI: 10.7270/Q2CN74ND