BDBM50111622 1,2-diphenyl-(E)-1-propene::CHEMBL14773
SMILES: C\C(=C/c1ccccc1)c1ccccc1
InChI Key: InChIKey=OVZXISBUYCEVEV-OUKQBFOZSA-N
Data: 1 IC50
Activity Spreadsheet -- Enzyme Inhibition Constant Data from BindingDB
Found 1 hit for monomerid = 50111622
Trg + Lig
Ki
nM
ΔG°
kcal/mole
IC50
nM
Kd
nM
EC50/IC50
nM
koff
s-1
kon
M-1s-1
pHTemp
°C
Lignostilbene alpha, beta-dioxygenase
(Pseudomonas paucimobilis)
BDBM50111622
(1,2-diphenyl-(E)-1-propene | CHEMBL14773)
Show SMILES C\C(=C/c1ccccc1)c1ccccc1
Show InChI InChI=1S/C15H14/c1-13(15-10-6-3-7-11-15)12-14-8-4-2-5-9-14/h2-12H,1H3/b13-12+
n/an/a>1.00E+5n/an/an/an/an/an/a
RIKEN
Curated by ChEMBL
Assay Description
Inhibitory concentration against Lignostilbene-alpha, beta-dioxygenase (LSD) was determined in 2 mL of 50 mM HCl buffer containing 4 microg enzyme/mL...
Bioorg Med Chem Lett 12: 1139-42 (2002)
BindingDB Entry DOI: 10.7270/Q2KS6QV0