BDBM50111843 (R)-2-[Benzo[1,3]dioxol-5-ylmethyl-(4-methoxy-benzenesulfonyl)-amino]-N-hydroxy-3-(4-methoxy-phenyl)-propionamide::CHEMBL21766
SMILES: COc1ccc(C[C@@H](N(Cc2ccc3OCOc3c2)S(=O)(=O)c2ccc(OC)cc2)C(=O)NO)cc1
InChI Key: InChIKey=GJZYDFICBCLUIW-JOCHJYFZSA-N
Data: 1 IC50
Activity Spreadsheet -- Enzyme Inhibition Constant Data from BindingDB
Found 1 hit for monomerid = 50111843
Trg + Lig
Ki
nM
ΔG°
kcal/mole
IC50
nM
Kd
nM
EC50/IC50
nM
koff
s-1
kon
M-1s-1
pHTemp
°C
Bone morphogenetic protein 1
(Homo sapiens (Human))
BDBM50111843
((R)-2-[Benzo[1,3]dioxol-5-ylmethyl-(4-methoxy-benz...)
Show SMILES COc1ccc(C[C@@H](N(Cc2ccc3OCOc3c2)S(=O)(=O)c2ccc(OC)cc2)C(=O)NO)cc1
Show InChI InChI=1S/C25H26N2O8S/c1-32-19-6-3-17(4-7-19)13-22(25(28)26-29)27(15-18-5-12-23-24(14-18)35-16-34-23)36(30,31)21-10-8-20(33-2)9-11-21/h3-12,14,22,29H,13,15-16H2,1-2H3,(H,26,28)/t22-/m1/s1
Reactome pathway
n/an/a 40n/an/an/an/an/an/a
Roche Bioscience
Curated by ChEMBL
Assay Description
Inhibitory activity against Procollagen C-Proteinase (PCP)
Bioorg Med Chem Lett 12: 1233-5 (2002)
BindingDB Entry DOI: 10.7270/Q29C6WR3