BDBM50111861 CHEMBL281582::{(R)-5-[Benzo[1,3]dioxol-5-ylmethyl-(4-methoxy-benzenesulfonyl)-amino]-5-hydroxycarbamoyl-pentyl}-carbamic acid benzyl ester
SMILES: COc1ccc(cc1)S(=O)(=O)N(Cc1ccc2OCOc2c1)[C@H](CCCCNC(=O)OCc1ccccc1)C(=O)NO
InChI Key: InChIKey=YQFZZIHZGQCWCQ-RUZDIDTESA-N
Data: 1 IC50
Activity Spreadsheet -- Enzyme Inhibition Constant Data from BindingDB
Found 1 hit for monomerid = 50111861
Trg + Lig
Ki
nM
ΔG°
kcal/mole
IC50
nM
Kd
nM
EC50/IC50
nM
koff
s-1
kon
M-1s-1
pHTemp
°C
Bone morphogenetic protein 1
(Homo sapiens (Human))
BDBM50111861
(CHEMBL281582 | {(R)-5-[Benzo[1,3]dioxol-5-ylmethyl...)
Show SMILES COc1ccc(cc1)S(=O)(=O)N(Cc1ccc2OCOc2c1)[C@H](CCCCNC(=O)OCc1ccccc1)C(=O)NO
Show InChI InChI=1S/C29H33N3O9S/c1-38-23-11-13-24(14-12-23)42(36,37)32(18-22-10-15-26-27(17-22)41-20-40-26)25(28(33)31-35)9-5-6-16-30-29(34)39-19-21-7-3-2-4-8-21/h2-4,7-8,10-15,17,25,35H,5-6,9,16,18-20H2,1H3,(H,30,34)(H,31,33)/t25-/m1/s1
Reactome pathway
n/an/a 16n/an/an/an/an/an/a
Roche Bioscience
Curated by ChEMBL
Assay Description
Inhibitory activity against Procollagen C-Proteinase (PCP)
Bioorg Med Chem Lett 12: 1233-5 (2002)
BindingDB Entry DOI: 10.7270/Q29C6WR3