BDBM50111902 2-(2-ethoxy-5-(4-methylpiperazin-1-ylsulfonyl)phenyl)-5-methyl-7-propylimidazo[1,5-f][1,2,4]triazin-4(3H)-one::2-[2-Ethoxy-5-(4-methyl-piperazine-1-sulfonyl)-phenyl]-5-methyl-7-propyl-3H-imidazo[5,1-f][1,2,4]triazin-4-one::CHEMBL168949
SMILES: CCCc1nc(C)c2n1nc([nH]c2=O)-c1cc(ccc1OCC)S(=O)(=O)N1CCN(C)CC1
InChI Key: InChIKey=AIVNVMRJLJHFCU-UHFFFAOYSA-N
Data: 15 IC50
Activity Spreadsheet -- Enzyme Inhibition Constant Data from BindingDB
Found 15 hits for monomerid = 50111902
Trg + Lig
Ki
nM
ΔG°
kcal/mole
IC50
nM
Kd
nM
EC50/IC50
nM
koff
s-1
kon
M-1s-1
pHTemp
°C
cGMP-specific 3',5'-cyclic phosphodiesterase
(Homo sapiens (Human))
BDBM50111902
(2-(2-ethoxy-5-(4-methylpiperazin-1-ylsulfonyl)phen...)
Show SMILES CCCc1nc(C)c2n1nc([nH]c2=O)-c1cc(ccc1OCC)S(=O)(=O)N1CCN(C)CC1
Show InChI InChI=1S/C22H30N6O4S/c1-5-7-19-23-15(3)20-22(29)24-21(25-28(19)20)17-14-16(8-9-18(17)32-6-2)33(30,31)27-12-10-26(4)11-13-27/h8-9,14H,5-7,10-13H2,1-4H3,(H,24,25,29)
Reactome pathway
n/an/a 0.600n/an/an/an/an/an/a
BAYER AG
Curated by ChEMBL
Assay Description
Inhibition of Phosphodiesterase 5
Bioorg Med Chem Lett 12: 865-8 (2002)
BindingDB Entry DOI: 10.7270/Q21V5D80
3D
3D Structure (docked)
3',5'-cyclic phosphodiesterase
(Homo sapiens (Human))
BDBM50111902
(2-(2-ethoxy-5-(4-methylpiperazin-1-ylsulfonyl)phen...)
Show SMILES CCCc1nc(C)c2n1nc([nH]c2=O)-c1cc(ccc1OCC)S(=O)(=O)N1CCN(C)CC1
Show InChI InChI=1S/C22H30N6O4S/c1-5-7-19-23-15(3)20-22(29)24-21(25-28(19)20)17-14-16(8-9-18(17)32-6-2)33(30,31)27-12-10-26(4)11-13-27/h8-9,14H,5-7,10-13H2,1-4H3,(H,24,25,29)
Reactome pathway
n/an/a 10n/an/an/an/an/an/a
Vrije Universiteit Amsterdam
Curated by ChEMBL
Assay Description
Inhibition of human His-tagged PDE5A catalytic domain expressed in Escherichia coli BL21-CodonPlus(DE3) cells using [3H]cAMP or [3H]cGMP as substrate...
J Med Chem 59: 7029-65 (2016)
Article DOI: 10.1021/acs.jmedchem.5b01813
3D
3D Structure (docked)
Phosphodiesterase 4
(Homo sapiens (Human))
BDBM50111902
(2-(2-ethoxy-5-(4-methylpiperazin-1-ylsulfonyl)phen...)
Show SMILES CCCc1nc(C)c2n1nc([nH]c2=O)-c1cc(ccc1OCC)S(=O)(=O)N1CCN(C)CC1
Show InChI InChI=1S/C22H30N6O4S/c1-5-7-19-23-15(3)20-22(29)24-21(25-28(19)20)17-14-16(8-9-18(17)32-6-2)33(30,31)27-12-10-26(4)11-13-27/h8-9,14H,5-7,10-13H2,1-4H3,(H,24,25,29)
n/an/a>500n/an/an/an/an/an/a
BAYER AG
Curated by ChEMBL
Assay Description
Inhibition of Phosphodiesterase 4
Bioorg Med Chem Lett 12: 865-8 (2002)
BindingDB Entry DOI: 10.7270/Q21V5D80
Phosphodiesterase 1
(Bos taurus-BOVINE)
BDBM50111902
(2-(2-ethoxy-5-(4-methylpiperazin-1-ylsulfonyl)phen...)
Show SMILES CCCc1nc(C)c2n1nc([nH]c2=O)-c1cc(ccc1OCC)S(=O)(=O)N1CCN(C)CC1
Show InChI InChI=1S/C22H30N6O4S/c1-5-7-19-23-15(3)20-22(29)24-21(25-28(19)20)17-14-16(8-9-18(17)32-6-2)33(30,31)27-12-10-26(4)11-13-27/h8-9,14H,5-7,10-13H2,1-4H3,(H,24,25,29)
n/an/a 300n/an/an/an/an/an/a
BAYER AG
Curated by ChEMBL
Assay Description
Inhibition of Phosphodiesterase 1
Bioorg Med Chem Lett 12: 865-8 (2002)
BindingDB Entry DOI: 10.7270/Q21V5D80
Phosphodiesterase 1
(Homo sapiens (Human))
BDBM50111902
(2-(2-ethoxy-5-(4-methylpiperazin-1-ylsulfonyl)phen...)
Show SMILES CCCc1nc(C)c2n1nc([nH]c2=O)-c1cc(ccc1OCC)S(=O)(=O)N1CCN(C)CC1
Show InChI InChI=1S/C22H30N6O4S/c1-5-7-19-23-15(3)20-22(29)24-21(25-28(19)20)17-14-16(8-9-18(17)32-6-2)33(30,31)27-12-10-26(4)11-13-27/h8-9,14H,5-7,10-13H2,1-4H3,(H,24,25,29)
n/an/a 300n/an/an/an/an/an/a
BAYER HealthCare AG
Curated by ChEMBL
Assay Description
Inhibition of phosphodiesterase 1
Bioorg Med Chem Lett 15: 3900-7 (2005)
Article DOI: 10.1016/j.bmcl.2005.05.090
BindingDB Entry DOI: 10.7270/Q2XS5TWD
cGMP-specific 3',5'-cyclic phosphodiesterase
(Homo sapiens (Human))
BDBM50111902
(2-(2-ethoxy-5-(4-methylpiperazin-1-ylsulfonyl)phen...)
Show SMILES CCCc1nc(C)c2n1nc([nH]c2=O)-c1cc(ccc1OCC)S(=O)(=O)N1CCN(C)CC1
Show InChI InChI=1S/C22H30N6O4S/c1-5-7-19-23-15(3)20-22(29)24-21(25-28(19)20)17-14-16(8-9-18(17)32-6-2)33(30,31)27-12-10-26(4)11-13-27/h8-9,14H,5-7,10-13H2,1-4H3,(H,24,25,29)
Reactome pathway
n/an/a 2n/an/an/an/an/an/a
BAYER HealthCare AG
Curated by ChEMBL
Assay Description
Inhibition of phosphodiesterase 5
Bioorg Med Chem Lett 15: 3900-7 (2005)
Article DOI: 10.1016/j.bmcl.2005.05.090
BindingDB Entry DOI: 10.7270/Q2XS5TWD
3D
3D Structure (docked)
cGMP-specific 3',5'-cyclic phosphodiesterase
(Homo sapiens (Human))
BDBM50111902
(2-(2-ethoxy-5-(4-methylpiperazin-1-ylsulfonyl)phen...)
Show SMILES CCCc1nc(C)c2n1nc([nH]c2=O)-c1cc(ccc1OCC)S(=O)(=O)N1CCN(C)CC1
Show InChI InChI=1S/C22H30N6O4S/c1-5-7-19-23-15(3)20-22(29)24-21(25-28(19)20)17-14-16(8-9-18(17)32-6-2)33(30,31)27-12-10-26(4)11-13-27/h8-9,14H,5-7,10-13H2,1-4H3,(H,24,25,29)
Reactome pathway
n/an/a 0.603n/an/an/an/an/an/a
Universidade Federal de Lavras-UFLA
Curated by ChEMBL
Assay Description
Inhibition of PDE5
Bioorg Med Chem 16: 7599-606 (2008)
Article DOI: 10.1016/j.bmc.2008.07.022
BindingDB Entry DOI: 10.7270/Q2VX0HRR
3D
3D Structure (docked)
3',5'-cyclic phosphodiesterase
(Homo sapiens (Human))
BDBM50111902
(2-(2-ethoxy-5-(4-methylpiperazin-1-ylsulfonyl)phen...)
Show SMILES CCCc1nc(C)c2n1nc([nH]c2=O)-c1cc(ccc1OCC)S(=O)(=O)N1CCN(C)CC1
Show InChI InChI=1S/C22H30N6O4S/c1-5-7-19-23-15(3)20-22(29)24-21(25-28(19)20)17-14-16(8-9-18(17)32-6-2)33(30,31)27-12-10-26(4)11-13-27/h8-9,14H,5-7,10-13H2,1-4H3,(H,24,25,29)
n/an/a 3.80E+3n/an/an/an/an/an/a
Vrije Universiteit Amsterdam
Curated by ChEMBL
Assay Description
Inhibition of human His-tagged PDE4B catalytic domain expressed in Escherichia coli BL21-CodonPlus(DE3) cells using [3H]cAMP or [3H]cGMP as substrate...
J Med Chem 59: 7029-65 (2016)
Article DOI: 10.1021/acs.jmedchem.5b01813
3',5'-cyclic phosphodiesterase
(Homo sapiens (Human))
BDBM50111902
(2-(2-ethoxy-5-(4-methylpiperazin-1-ylsulfonyl)phen...)
Show SMILES CCCc1nc(C)c2n1nc([nH]c2=O)-c1cc(ccc1OCC)S(=O)(=O)N1CCN(C)CC1
Show InChI InChI=1S/C22H30N6O4S/c1-5-7-19-23-15(3)20-22(29)24-21(25-28(19)20)17-14-16(8-9-18(17)32-6-2)33(30,31)27-12-10-26(4)11-13-27/h8-9,14H,5-7,10-13H2,1-4H3,(H,24,25,29)
Reactome pathway
n/an/a 10n/an/an/an/an/an/a
Vrije Universiteit Amsterdam
Curated by ChEMBL
Assay Description
Inhibition of human PDE5A
J Med Chem 59: 7029-65 (2016)
Article DOI: 10.1021/acs.jmedchem.5b01813
3D
3D Structure (docked)
3',5'-cyclic phosphodiesterase
(Homo sapiens (Human))
BDBM50111902
(2-(2-ethoxy-5-(4-methylpiperazin-1-ylsulfonyl)phen...)
Show SMILES CCCc1nc(C)c2n1nc([nH]c2=O)-c1cc(ccc1OCC)S(=O)(=O)N1CCN(C)CC1
Show InChI InChI=1S/C22H30N6O4S/c1-5-7-19-23-15(3)20-22(29)24-21(25-28(19)20)17-14-16(8-9-18(17)32-6-2)33(30,31)27-12-10-26(4)11-13-27/h8-9,14H,5-7,10-13H2,1-4H3,(H,24,25,29)
n/an/a 3.80E+3n/an/an/an/an/an/a
Vrije Universiteit Amsterdam
Curated by ChEMBL
Assay Description
Inhibition of human His-tagged PDE4B catalytic domain expressed in Escherichia coli BL21-CodonPlus(DE3) cells using [3H]cAMP or [3H]cGMP as substrate...
J Med Chem 59: 7029-65 (2016)
Article DOI: 10.1021/acs.jmedchem.5b01813
3',5'-cyclic phosphodiesterase
(Homo sapiens (Human))
BDBM50111902
(2-(2-ethoxy-5-(4-methylpiperazin-1-ylsulfonyl)phen...)
Show SMILES CCCc1nc(C)c2n1nc([nH]c2=O)-c1cc(ccc1OCC)S(=O)(=O)N1CCN(C)CC1
Show InChI InChI=1S/C22H30N6O4S/c1-5-7-19-23-15(3)20-22(29)24-21(25-28(19)20)17-14-16(8-9-18(17)32-6-2)33(30,31)27-12-10-26(4)11-13-27/h8-9,14H,5-7,10-13H2,1-4H3,(H,24,25,29)
Reactome pathway
n/an/a 10n/an/an/an/an/an/a
Vrije Universiteit Amsterdam
Curated by ChEMBL
Assay Description
Inhibition of human PDE5A
J Med Chem 59: 7029-65 (2016)
Article DOI: 10.1021/acs.jmedchem.5b01813
3D
3D Structure (docked)
3',5'-cyclic phosphodiesterase
(Homo sapiens (Human))
BDBM50111902
(2-(2-ethoxy-5-(4-methylpiperazin-1-ylsulfonyl)phen...)
Show SMILES CCCc1nc(C)c2n1nc([nH]c2=O)-c1cc(ccc1OCC)S(=O)(=O)N1CCN(C)CC1
Show InChI InChI=1S/C22H30N6O4S/c1-5-7-19-23-15(3)20-22(29)24-21(25-28(19)20)17-14-16(8-9-18(17)32-6-2)33(30,31)27-12-10-26(4)11-13-27/h8-9,14H,5-7,10-13H2,1-4H3,(H,24,25,29)
Reactome pathway
n/an/a 10n/an/an/an/an/an/a
Vrije Universiteit Amsterdam
Curated by ChEMBL
Assay Description
Inhibition of recombinant human PDE5A1 catalytic domain (535 to 860 residues) expressed in Escherichia coli BL21-CodonPlus(DE3) cells
J Med Chem 59: 7029-65 (2016)
Article DOI: 10.1021/acs.jmedchem.5b01813
3D
3D Structure (docked)
3',5'-cyclic phosphodiesterase
(Homo sapiens (Human))
BDBM50111902
(2-(2-ethoxy-5-(4-methylpiperazin-1-ylsulfonyl)phen...)
Show SMILES CCCc1nc(C)c2n1nc([nH]c2=O)-c1cc(ccc1OCC)S(=O)(=O)N1CCN(C)CC1
Show InChI InChI=1S/C22H30N6O4S/c1-5-7-19-23-15(3)20-22(29)24-21(25-28(19)20)17-14-16(8-9-18(17)32-6-2)33(30,31)27-12-10-26(4)11-13-27/h8-9,14H,5-7,10-13H2,1-4H3,(H,24,25,29)
Reactome pathway
n/an/a 10n/an/an/an/an/an/a
Vrije Universiteit Amsterdam
Curated by ChEMBL
Assay Description
Inhibition of human His-tagged PDE5A catalytic domain expressed in Escherichia coli BL21-CodonPlus(DE3) cells using [3H]cAMP or [3H]cGMP as substrate...
J Med Chem 59: 7029-65 (2016)
Article DOI: 10.1021/acs.jmedchem.5b01813
3D
3D Structure (docked)
3',5'-cyclic phosphodiesterase
(Homo sapiens (Human))
BDBM50111902
(2-(2-ethoxy-5-(4-methylpiperazin-1-ylsulfonyl)phen...)
Show SMILES CCCc1nc(C)c2n1nc([nH]c2=O)-c1cc(ccc1OCC)S(=O)(=O)N1CCN(C)CC1
Show InChI InChI=1S/C22H30N6O4S/c1-5-7-19-23-15(3)20-22(29)24-21(25-28(19)20)17-14-16(8-9-18(17)32-6-2)33(30,31)27-12-10-26(4)11-13-27/h8-9,14H,5-7,10-13H2,1-4H3,(H,24,25,29)
Reactome pathway
n/an/a 10n/an/an/an/an/an/a
Vrije Universiteit Amsterdam
Curated by ChEMBL
Assay Description
Inhibition of recombinant human PDE5A1 catalytic domain (535 to 860 residues) expressed in Escherichia coli BL21-CodonPlus(DE3) cells
J Med Chem 59: 7029-65 (2016)
Article DOI: 10.1021/acs.jmedchem.5b01813
3D
3D Structure (docked)
Phosphodiesterase 3
(Homo sapiens (Human))
BDBM50111902
(2-(2-ethoxy-5-(4-methylpiperazin-1-ylsulfonyl)phen...)
Show SMILES CCCc1nc(C)c2n1nc([nH]c2=O)-c1cc(ccc1OCC)S(=O)(=O)N1CCN(C)CC1
Show InChI InChI=1S/C22H30N6O4S/c1-5-7-19-23-15(3)20-22(29)24-21(25-28(19)20)17-14-16(8-9-18(17)32-6-2)33(30,31)27-12-10-26(4)11-13-27/h8-9,14H,5-7,10-13H2,1-4H3,(H,24,25,29)
n/an/a>500n/an/an/an/an/an/a
BAYER AG
Curated by ChEMBL
Assay Description
Inhibition of Phosphodiesterase 3
Bioorg Med Chem Lett 12: 865-8 (2002)
BindingDB Entry DOI: 10.7270/Q21V5D80