BDBM50112166 CHEMBL3608422
SMILES: CNC(=O)c1ccc(Cn2cc(C(=O)N[C@H]3COCC[C@@H]3O)c3ncccc23)cc1
InChI Key: InChIKey=IZXFTAMPTGSWLG-HKUYNNGSSA-N
Data: 2 EC50
Activity Spreadsheet -- Enzyme Inhibition Constant Data from BindingDB
Found 2 hits for monomerid = 50112166
Trg + Lig
Ki
nM
ΔG°
kcal/mole
IC50
nM
Kd
nM
EC50/IC50
nM
koff
s-1
kon
M-1s-1
pHTemp
°C
Muscarinic acetylcholine receptor M1
(RAT)
BDBM50112166
(CHEMBL3608422)
Show SMILES CNC(=O)c1ccc(Cn2cc(C(=O)N[C@H]3COCC[C@@H]3O)c3ncccc23)cc1 |r|
Show InChI InChI=1S/C22H24N4O4/c1-23-21(28)15-6-4-14(5-7-15)11-26-12-16(20-18(26)3-2-9-24-20)22(29)25-17-13-30-10-8-19(17)27/h2-7,9,12,17,19,27H,8,10-11,13H2,1H3,(H,23,28)(H,25,29)/t17-,19-/m0/s1
Reactome pathway
n/an/an/an/a 18n/an/an/an/a
Temple University School of Pharmacy
Curated by ChEMBL
Assay Description
Positive allosteric modulation of rat muscarinic M1 receptor expressed in CHO cells assessed as basal and acetylcholine-stimulated Ca2+ level by FLIP...
ACS Med Chem Lett 6: 726-8 (2015)
BindingDB Entry DOI: 10.7270/Q26W9CVM
Muscarinic acetylcholine receptor M1
(Homo sapiens (Human))
BDBM50112166
(CHEMBL3608422)
Show SMILES CNC(=O)c1ccc(Cn2cc(C(=O)N[C@H]3COCC[C@@H]3O)c3ncccc23)cc1 |r|
Show InChI InChI=1S/C22H24N4O4/c1-23-21(28)15-6-4-14(5-7-15)11-26-12-16(20-18(26)3-2-9-24-20)22(29)25-17-13-30-10-8-19(17)27/h2-7,9,12,17,19,27H,8,10-11,13H2,1H3,(H,23,28)(H,25,29)/t17-,19-/m0/s1
n/an/an/an/a 9.10n/an/an/an/a
Temple University School of Pharmacy
Curated by ChEMBL
Assay Description
Positive allosteric modulation of human muscarinic M1 receptor expressed in CHO cells assessed as basal and acetylcholine-stimulated Ca2+ level by FL...
ACS Med Chem Lett 6: 726-8 (2015)
BindingDB Entry DOI: 10.7270/Q26W9CVM