BDBM50112213 1-Azido-2-bromo-2-chloro-1,1-difluoro-ethane::CHEMBL55065
SMILES: FC(F)(N=[N+]=[N-])C(Cl)Br
InChI Key: InChIKey=GHPQXFNMEDAROG-UHFFFAOYSA-N
Data: 1 IC50
Activity Spreadsheet -- Enzyme Inhibition Constant Data from BindingDB
Found 1 hit for monomerid = 50112213
Trg + Lig
Ki
nM
ΔG°
kcal/mole
IC50
nM
Kd
nM
EC50/IC50
nM
koff
s-1
kon
M-1s-1
pHTemp
°C
Serum albumin
(Homo sapiens (Human))
BDBM50112213
(1-Azido-2-bromo-2-chloro-1,1-difluoro-ethane | CHE...)
Show SMILES FC(F)(N=[N+]=[N-])C(Cl)Br
Show InChI InChI=1S/C2HBrClF2N3/c3-1(4)2(5,6)8-9-7/h1H
NCI pathway
Reactome pathway
n/an/a 3.00E+5n/an/an/an/an/an/a
University of Pennsylvania Health System
Curated by ChEMBL
Assay Description
Inhibitory concentration of the compound bound to tryptophan containing region of Serum albumin in fluorescence quenching
J Med Chem 45: 1879-86 (2002)
BindingDB Entry DOI: 10.7270/Q2QF8S79