BDBM50112345 CHEMBL3609315
SMILES: CC[C@H]1N(C2CCCC2)c2nc(Oc3ccc(cc3OC)C(=O)NC3CCN(C)CC3)ncc2N(C)C1=O
InChI Key: InChIKey=MLSIWMLVUIWYLH-OAQYLSRUSA-N
Data: 2 KI  2 IC50
Activity Spreadsheet -- Enzyme Inhibition Constant Data from BindingDB
Found 4 hits for monomerid = 50112345
Trg + Lig
Ki
nM
ΔG°
kcal/mole
IC50
nM
Kd
nM
EC50/IC50
nM
koff
s-1
kon
M-1s-1
pHTemp
°C
Bromodomain-containing protein 4
(Homo sapiens (Human))
BDBM50112345
(CHEMBL3609315)
Show SMILES CC[C@H]1N(C2CCCC2)c2nc(Oc3ccc(cc3OC)C(=O)NC3CCN(C)CC3)ncc2N(C)C1=O |r|
Show InChI InChI=1S/C28H38N6O4/c1-5-21-27(36)33(3)22-17-29-28(31-25(22)34(21)20-8-6-7-9-20)38-23-11-10-18(16-24(23)37-4)26(35)30-19-12-14-32(2)15-13-19/h10-11,16-17,19-21H,5-9,12-15H2,1-4H3,(H,30,35)/t21-/m1/s1
99n/an/an/an/an/an/an/an/a
University of Maryland
Curated by ChEMBL
Assay Description
Binding affinity to BRD4 (unknown origin) expressed in Escherichia coli BL21 after 1 hr by proprietary competition assay
ACS Med Chem Lett 6: 764-9 (2015)
BindingDB Entry DOI: 10.7270/Q2FF3V4D
Serine/threonine-protein kinase PLK1
(Homo sapiens (Human))
BDBM50112345
(CHEMBL3609315)
Show SMILES CC[C@H]1N(C2CCCC2)c2nc(Oc3ccc(cc3OC)C(=O)NC3CCN(C)CC3)ncc2N(C)C1=O |r|
Show InChI InChI=1S/C28H38N6O4/c1-5-21-27(36)33(3)22-17-29-28(31-25(22)34(21)20-8-6-7-9-20)38-23-11-10-18(16-24(23)37-4)26(35)30-19-12-14-32(2)15-13-19/h10-11,16-17,19-21H,5-9,12-15H2,1-4H3,(H,30,35)/t21-/m1/s1
NCI pathway
Reactome pathway
240n/an/an/an/an/an/an/an/a
University of Maryland
Curated by ChEMBL
Assay Description
Binding affinity to PLK1 (unknown origin) expressed in HEK293 cells after 1 hr by proprietary competition assay
ACS Med Chem Lett 6: 764-9 (2015)
BindingDB Entry DOI: 10.7270/Q2FF3V4D
Bromodomain-containing protein 4
(Homo sapiens (Human))
BDBM50112345
(CHEMBL3609315)
Show SMILES CC[C@H]1N(C2CCCC2)c2nc(Oc3ccc(cc3OC)C(=O)NC3CCN(C)CC3)ncc2N(C)C1=O |r|
Show InChI InChI=1S/C28H38N6O4/c1-5-21-27(36)33(3)22-17-29-28(31-25(22)34(21)20-8-6-7-9-20)38-23-11-10-18(16-24(23)37-4)26(35)30-19-12-14-32(2)15-13-19/h10-11,16-17,19-21H,5-9,12-15H2,1-4H3,(H,30,35)/t21-/m1/s1
n/an/a 620n/an/an/an/an/an/a
Dana Farber Cancer Institute
Curated by ChEMBL
Assay Description
Displacement of Bio-JQ1 from recombinant human His6 tagged BRD4 bromodomain 1 by alphascreen assay
ACS Med Chem Lett 10: 1443-1449 (2019)
Article DOI: 10.1021/acsmedchemlett.9b00243
Transcription initiation factor TFIID subunit 1
(Homo sapiens (Human))
BDBM50112345
(CHEMBL3609315)
Show SMILES CC[C@H]1N(C2CCCC2)c2nc(Oc3ccc(cc3OC)C(=O)NC3CCN(C)CC3)ncc2N(C)C1=O |r|
Show InChI InChI=1S/C28H38N6O4/c1-5-21-27(36)33(3)22-17-29-28(31-25(22)34(21)20-8-6-7-9-20)38-23-11-10-18(16-24(23)37-4)26(35)30-19-12-14-32(2)15-13-19/h10-11,16-17,19-21H,5-9,12-15H2,1-4H3,(H,30,35)/t21-/m1/s1
n/an/a>1.00E+4n/an/an/an/an/an/a
Dana Farber Cancer Institute
Curated by ChEMBL
Assay Description
Displacement of biotinylated probe from human TAF1 bromodomain 2 (1522 to 1656 residues) expressed in Escherichia coli BL21 (DE3) by alphascreen assa...
ACS Med Chem Lett 10: 1443-1449 (2019)
Article DOI: 10.1021/acsmedchemlett.9b00243