BDBM50112346 CHEMBL3609325
SMILES: [H][C@@]12CN(C(=O)[C@@H](NC(=O)[C@H](C)NC)C(C)(C)C)[C@@]([H])(C1)C(=O)N[C@@H](Cc1ccc3ccccc3c1)C(=O)N[C@@H](Cc1ccc(OCc3cn(nn3)[C@]3([H])CN(C(=O)[C@@H](NC(=O)[C@H](C)NC)C(C)(C)C)[C@@]([H])(C3)C(=O)N[C@@H](Cc3ccc4ccccc4c3)C(=O)N[C@@H](Cc3ccc(OCCCC2)cc3)C(O)=O)cc1)NS(=O)(=O)C1CC1
InChI Key: InChIKey=MLQVQPMTZJBGEY-VGEDNRJQSA-N
Data: 8 IC50  2 EC50
Activity Spreadsheet -- Enzyme Inhibition Constant Data from BindingDB
Found 10 hits for monomerid = 50112346
Trg + Lig
Ki
nM
ΔG°
kcal/mole
IC50
nM
Kd
nM
EC50/IC50
nM
koff
s-1
kon
M-1s-1
pHTemp
°C
X-linked inhibitor of apoptosis protein (XIAP)
(Homo sapiens (Human))
BDBM50112346
(CHEMBL3609325)
Show SMILES [H][C@@]12CN(C(=O)[C@@H](NC(=O)[C@H](C)NC)C(C)(C)C)[C@@]([H])(C1)C(=O)N[C@@H](Cc1ccc3ccccc3c1)C(=O)N[C@@H](Cc1ccc(OCc3cn(nn3)[C@]3([H])CN(C(=O)[C@@H](NC(=O)[C@H](C)NC)C(C)(C)C)[C@@]([H])(C3)C(=O)N[C@@H](Cc3ccc4ccccc4c3)C(=O)N[C@@H](Cc3ccc(OCCCC2)cc3)C(O)=O)cc1)NS(=O)(=O)C1CC1 |r|
Show InChI InChI=1S/C83H106N14O14S/c1-49(84-9)73(98)90-71(82(3,4)5)79(104)95-45-55-17-15-16-36-110-62-30-24-51(25-31-62)39-67(81(106)107)88-75(100)65(40-53-22-28-56-18-11-13-20-58(56)37-53)86-78(103)69-44-61(47-96(69)80(105)72(83(6,7)8)91-74(99)50(2)85-10)97-46-60(92-94-97)48-111-63-32-26-52(27-33-63)43-70(93-112(108,109)64-34-35-64)89-76(101)66(87-77(102)68(95)42-55)41-54-23-29-57-19-12-14-21-59(57)38-54/h11-14,18-33,37-38,46,49-50,55,61,64-72,84-85,93H,15-17,34-36,39-45,47-48H2,1-10H3,(H,86,103)(H,87,102)(H,88,100)(H,89,101)(H,90,98)(H,91,99)(H,106,107)/t49-,50-,55-,61-,65-,66-,67-,68-,69-,70+,71+,72+/m0/s1
n/an/a 3.5n/an/an/an/an/an/a
Bristol-Myers Squibb Research
Curated by ChEMBL
Assay Description
Inhibition of XIAP BIR3 domain (unknown origin)
ACS Med Chem Lett 6: 770-5 (2015)
BindingDB Entry DOI: 10.7270/Q29P33D2
Baculoviral IAP repeat-containing protein 3 (IAP1 BIR3)
(Homo sapiens (Human))
BDBM50112346
(CHEMBL3609325)
Show SMILES [H][C@@]12CN(C(=O)[C@@H](NC(=O)[C@H](C)NC)C(C)(C)C)[C@@]([H])(C1)C(=O)N[C@@H](Cc1ccc3ccccc3c1)C(=O)N[C@@H](Cc1ccc(OCc3cn(nn3)[C@]3([H])CN(C(=O)[C@@H](NC(=O)[C@H](C)NC)C(C)(C)C)[C@@]([H])(C3)C(=O)N[C@@H](Cc3ccc4ccccc4c3)C(=O)N[C@@H](Cc3ccc(OCCCC2)cc3)C(O)=O)cc1)NS(=O)(=O)C1CC1 |r|
Show InChI InChI=1S/C83H106N14O14S/c1-49(84-9)73(98)90-71(82(3,4)5)79(104)95-45-55-17-15-16-36-110-62-30-24-51(25-31-62)39-67(81(106)107)88-75(100)65(40-53-22-28-56-18-11-13-20-58(56)37-53)86-78(103)69-44-61(47-96(69)80(105)72(83(6,7)8)91-74(99)50(2)85-10)97-46-60(92-94-97)48-111-63-32-26-52(27-33-63)43-70(93-112(108,109)64-34-35-64)89-76(101)66(87-77(102)68(95)42-55)41-54-23-29-57-19-12-14-21-59(57)38-54/h11-14,18-33,37-38,46,49-50,55,61,64-72,84-85,93H,15-17,34-36,39-45,47-48H2,1-10H3,(H,86,103)(H,87,102)(H,88,100)(H,89,101)(H,90,98)(H,91,99)(H,106,107)/t49-,50-,55-,61-,65-,66-,67-,68-,69-,70+,71+,72+/m0/s1
n/an/a 3n/an/an/an/an/an/a
Bristol-Myers Squibb Research
Curated by ChEMBL
Assay Description
Inhibition of cIAP BIR2-3 domain (unknown origin)
ACS Med Chem Lett 6: 770-5 (2015)
BindingDB Entry DOI: 10.7270/Q29P33D2
X-linked inhibitor of apoptosis protein (XIAP)
(Homo sapiens (Human))
BDBM50112346
(CHEMBL3609325)
Show SMILES [H][C@@]12CN(C(=O)[C@@H](NC(=O)[C@H](C)NC)C(C)(C)C)[C@@]([H])(C1)C(=O)N[C@@H](Cc1ccc3ccccc3c1)C(=O)N[C@@H](Cc1ccc(OCc3cn(nn3)[C@]3([H])CN(C(=O)[C@@H](NC(=O)[C@H](C)NC)C(C)(C)C)[C@@]([H])(C3)C(=O)N[C@@H](Cc3ccc4ccccc4c3)C(=O)N[C@@H](Cc3ccc(OCCCC2)cc3)C(O)=O)cc1)NS(=O)(=O)C1CC1 |r|
Show InChI InChI=1S/C83H106N14O14S/c1-49(84-9)73(98)90-71(82(3,4)5)79(104)95-45-55-17-15-16-36-110-62-30-24-51(25-31-62)39-67(81(106)107)88-75(100)65(40-53-22-28-56-18-11-13-20-58(56)37-53)86-78(103)69-44-61(47-96(69)80(105)72(83(6,7)8)91-74(99)50(2)85-10)97-46-60(92-94-97)48-111-63-32-26-52(27-33-63)43-70(93-112(108,109)64-34-35-64)89-76(101)66(87-77(102)68(95)42-55)41-54-23-29-57-19-12-14-21-59(57)38-54/h11-14,18-33,37-38,46,49-50,55,61,64-72,84-85,93H,15-17,34-36,39-45,47-48H2,1-10H3,(H,86,103)(H,87,102)(H,88,100)(H,89,101)(H,90,98)(H,91,99)(H,106,107)/t49-,50-,55-,61-,65-,66-,67-,68-,69-,70+,71+,72+/m0/s1
n/an/an/an/a 9.40n/an/an/an/a
Bristol-Myers Squibb Research
Curated by ChEMBL
Assay Description
Inhibition of XIAP (unknown origin) by caspase-3 rescue assay
ACS Med Chem Lett 6: 770-5 (2015)
BindingDB Entry DOI: 10.7270/Q29P33D2
Cytochrome P450 1A
(Homo sapiens (Human))
BDBM50112346
(CHEMBL3609325)
Show SMILES [H][C@@]12CN(C(=O)[C@@H](NC(=O)[C@H](C)NC)C(C)(C)C)[C@@]([H])(C1)C(=O)N[C@@H](Cc1ccc3ccccc3c1)C(=O)N[C@@H](Cc1ccc(OCc3cn(nn3)[C@]3([H])CN(C(=O)[C@@H](NC(=O)[C@H](C)NC)C(C)(C)C)[C@@]([H])(C3)C(=O)N[C@@H](Cc3ccc4ccccc4c3)C(=O)N[C@@H](Cc3ccc(OCCCC2)cc3)C(O)=O)cc1)NS(=O)(=O)C1CC1 |r|
Show InChI InChI=1S/C83H106N14O14S/c1-49(84-9)73(98)90-71(82(3,4)5)79(104)95-45-55-17-15-16-36-110-62-30-24-51(25-31-62)39-67(81(106)107)88-75(100)65(40-53-22-28-56-18-11-13-20-58(56)37-53)86-78(103)69-44-61(47-96(69)80(105)72(83(6,7)8)91-74(99)50(2)85-10)97-46-60(92-94-97)48-111-63-32-26-52(27-33-63)43-70(93-112(108,109)64-34-35-64)89-76(101)66(87-77(102)68(95)42-55)41-54-23-29-57-19-12-14-21-59(57)38-54/h11-14,18-33,37-38,46,49-50,55,61,64-72,84-85,93H,15-17,34-36,39-45,47-48H2,1-10H3,(H,86,103)(H,87,102)(H,88,100)(H,89,101)(H,90,98)(H,91,99)(H,106,107)/t49-,50-,55-,61-,65-,66-,67-,68-,69-,70+,71+,72+/m0/s1
Reactome pathway
n/an/a>2.00E+4n/an/an/an/an/an/a
Bristol-Myers Squibb Research
Curated by ChEMBL
Assay Description
Inhibition of human CYP1A2
ACS Med Chem Lett 6: 770-5 (2015)
BindingDB Entry DOI: 10.7270/Q29P33D2
Pregnane X receptor
(Homo sapiens (Human))
BDBM50112346
(CHEMBL3609325)
Show SMILES [H][C@@]12CN(C(=O)[C@@H](NC(=O)[C@H](C)NC)C(C)(C)C)[C@@]([H])(C1)C(=O)N[C@@H](Cc1ccc3ccccc3c1)C(=O)N[C@@H](Cc1ccc(OCc3cn(nn3)[C@]3([H])CN(C(=O)[C@@H](NC(=O)[C@H](C)NC)C(C)(C)C)[C@@]([H])(C3)C(=O)N[C@@H](Cc3ccc4ccccc4c3)C(=O)N[C@@H](Cc3ccc(OCCCC2)cc3)C(O)=O)cc1)NS(=O)(=O)C1CC1 |r|
Show InChI InChI=1S/C83H106N14O14S/c1-49(84-9)73(98)90-71(82(3,4)5)79(104)95-45-55-17-15-16-36-110-62-30-24-51(25-31-62)39-67(81(106)107)88-75(100)65(40-53-22-28-56-18-11-13-20-58(56)37-53)86-78(103)69-44-61(47-96(69)80(105)72(83(6,7)8)91-74(99)50(2)85-10)97-46-60(92-94-97)48-111-63-32-26-52(27-33-63)43-70(93-112(108,109)64-34-35-64)89-76(101)66(87-77(102)68(95)42-55)41-54-23-29-57-19-12-14-21-59(57)38-54/h11-14,18-33,37-38,46,49-50,55,61,64-72,84-85,93H,15-17,34-36,39-45,47-48H2,1-10H3,(H,86,103)(H,87,102)(H,88,100)(H,89,101)(H,90,98)(H,91,99)(H,106,107)/t49-,50-,55-,61-,65-,66-,67-,68-,69-,70+,71+,72+/m0/s1
n/an/an/an/a>5.00E+4n/an/an/an/a
Bristol-Myers Squibb Research
Curated by ChEMBL
Assay Description
Activation of PXR (unknown origin) by receptor transactivation assay
ACS Med Chem Lett 6: 770-5 (2015)
BindingDB Entry DOI: 10.7270/Q29P33D2
Cytochrome P450 2C8
(Homo sapiens (Human))
BDBM50112346
(CHEMBL3609325)
Show SMILES [H][C@@]12CN(C(=O)[C@@H](NC(=O)[C@H](C)NC)C(C)(C)C)[C@@]([H])(C1)C(=O)N[C@@H](Cc1ccc3ccccc3c1)C(=O)N[C@@H](Cc1ccc(OCc3cn(nn3)[C@]3([H])CN(C(=O)[C@@H](NC(=O)[C@H](C)NC)C(C)(C)C)[C@@]([H])(C3)C(=O)N[C@@H](Cc3ccc4ccccc4c3)C(=O)N[C@@H](Cc3ccc(OCCCC2)cc3)C(O)=O)cc1)NS(=O)(=O)C1CC1 |r|
Show InChI InChI=1S/C83H106N14O14S/c1-49(84-9)73(98)90-71(82(3,4)5)79(104)95-45-55-17-15-16-36-110-62-30-24-51(25-31-62)39-67(81(106)107)88-75(100)65(40-53-22-28-56-18-11-13-20-58(56)37-53)86-78(103)69-44-61(47-96(69)80(105)72(83(6,7)8)91-74(99)50(2)85-10)97-46-60(92-94-97)48-111-63-32-26-52(27-33-63)43-70(93-112(108,109)64-34-35-64)89-76(101)66(87-77(102)68(95)42-55)41-54-23-29-57-19-12-14-21-59(57)38-54/h11-14,18-33,37-38,46,49-50,55,61,64-72,84-85,93H,15-17,34-36,39-45,47-48H2,1-10H3,(H,86,103)(H,87,102)(H,88,100)(H,89,101)(H,90,98)(H,91,99)(H,106,107)/t49-,50-,55-,61-,65-,66-,67-,68-,69-,70+,71+,72+/m0/s1
n/an/a>2.00E+4n/an/an/an/an/an/a
Bristol-Myers Squibb Research
Curated by ChEMBL
Assay Description
Inhibition of human CYP2C8
ACS Med Chem Lett 6: 770-5 (2015)
BindingDB Entry DOI: 10.7270/Q29P33D2
Cytochrome P450 2C9
(Homo sapiens (Human))
BDBM50112346
(CHEMBL3609325)
Show SMILES [H][C@@]12CN(C(=O)[C@@H](NC(=O)[C@H](C)NC)C(C)(C)C)[C@@]([H])(C1)C(=O)N[C@@H](Cc1ccc3ccccc3c1)C(=O)N[C@@H](Cc1ccc(OCc3cn(nn3)[C@]3([H])CN(C(=O)[C@@H](NC(=O)[C@H](C)NC)C(C)(C)C)[C@@]([H])(C3)C(=O)N[C@@H](Cc3ccc4ccccc4c3)C(=O)N[C@@H](Cc3ccc(OCCCC2)cc3)C(O)=O)cc1)NS(=O)(=O)C1CC1 |r|
Show InChI InChI=1S/C83H106N14O14S/c1-49(84-9)73(98)90-71(82(3,4)5)79(104)95-45-55-17-15-16-36-110-62-30-24-51(25-31-62)39-67(81(106)107)88-75(100)65(40-53-22-28-56-18-11-13-20-58(56)37-53)86-78(103)69-44-61(47-96(69)80(105)72(83(6,7)8)91-74(99)50(2)85-10)97-46-60(92-94-97)48-111-63-32-26-52(27-33-63)43-70(93-112(108,109)64-34-35-64)89-76(101)66(87-77(102)68(95)42-55)41-54-23-29-57-19-12-14-21-59(57)38-54/h11-14,18-33,37-38,46,49-50,55,61,64-72,84-85,93H,15-17,34-36,39-45,47-48H2,1-10H3,(H,86,103)(H,87,102)(H,88,100)(H,89,101)(H,90,98)(H,91,99)(H,106,107)/t49-,50-,55-,61-,65-,66-,67-,68-,69-,70+,71+,72+/m0/s1
Reactome pathway
n/an/a>2.00E+4n/an/an/an/an/an/a
Bristol-Myers Squibb Research
Curated by ChEMBL
Assay Description
Inhibition of human CYP2C9
ACS Med Chem Lett 6: 770-5 (2015)
BindingDB Entry DOI: 10.7270/Q29P33D2
Cytochrome P450 2D6
(Homo sapiens (Human))
BDBM50112346
(CHEMBL3609325)
Show SMILES [H][C@@]12CN(C(=O)[C@@H](NC(=O)[C@H](C)NC)C(C)(C)C)[C@@]([H])(C1)C(=O)N[C@@H](Cc1ccc3ccccc3c1)C(=O)N[C@@H](Cc1ccc(OCc3cn(nn3)[C@]3([H])CN(C(=O)[C@@H](NC(=O)[C@H](C)NC)C(C)(C)C)[C@@]([H])(C3)C(=O)N[C@@H](Cc3ccc4ccccc4c3)C(=O)N[C@@H](Cc3ccc(OCCCC2)cc3)C(O)=O)cc1)NS(=O)(=O)C1CC1 |r|
Show InChI InChI=1S/C83H106N14O14S/c1-49(84-9)73(98)90-71(82(3,4)5)79(104)95-45-55-17-15-16-36-110-62-30-24-51(25-31-62)39-67(81(106)107)88-75(100)65(40-53-22-28-56-18-11-13-20-58(56)37-53)86-78(103)69-44-61(47-96(69)80(105)72(83(6,7)8)91-74(99)50(2)85-10)97-46-60(92-94-97)48-111-63-32-26-52(27-33-63)43-70(93-112(108,109)64-34-35-64)89-76(101)66(87-77(102)68(95)42-55)41-54-23-29-57-19-12-14-21-59(57)38-54/h11-14,18-33,37-38,46,49-50,55,61,64-72,84-85,93H,15-17,34-36,39-45,47-48H2,1-10H3,(H,86,103)(H,87,102)(H,88,100)(H,89,101)(H,90,98)(H,91,99)(H,106,107)/t49-,50-,55-,61-,65-,66-,67-,68-,69-,70+,71+,72+/m0/s1
n/an/a>2.00E+4n/an/an/an/an/an/a
Bristol-Myers Squibb Research
Curated by ChEMBL
Assay Description
Inhibition of human CYP2D6
ACS Med Chem Lett 6: 770-5 (2015)
BindingDB Entry DOI: 10.7270/Q29P33D2
Cytochrome P450 3A4
(Homo sapiens (Human))
BDBM50112346
(CHEMBL3609325)
Show SMILES [H][C@@]12CN(C(=O)[C@@H](NC(=O)[C@H](C)NC)C(C)(C)C)[C@@]([H])(C1)C(=O)N[C@@H](Cc1ccc3ccccc3c1)C(=O)N[C@@H](Cc1ccc(OCc3cn(nn3)[C@]3([H])CN(C(=O)[C@@H](NC(=O)[C@H](C)NC)C(C)(C)C)[C@@]([H])(C3)C(=O)N[C@@H](Cc3ccc4ccccc4c3)C(=O)N[C@@H](Cc3ccc(OCCCC2)cc3)C(O)=O)cc1)NS(=O)(=O)C1CC1 |r|
Show InChI InChI=1S/C83H106N14O14S/c1-49(84-9)73(98)90-71(82(3,4)5)79(104)95-45-55-17-15-16-36-110-62-30-24-51(25-31-62)39-67(81(106)107)88-75(100)65(40-53-22-28-56-18-11-13-20-58(56)37-53)86-78(103)69-44-61(47-96(69)80(105)72(83(6,7)8)91-74(99)50(2)85-10)97-46-60(92-94-97)48-111-63-32-26-52(27-33-63)43-70(93-112(108,109)64-34-35-64)89-76(101)66(87-77(102)68(95)42-55)41-54-23-29-57-19-12-14-21-59(57)38-54/h11-14,18-33,37-38,46,49-50,55,61,64-72,84-85,93H,15-17,34-36,39-45,47-48H2,1-10H3,(H,86,103)(H,87,102)(H,88,100)(H,89,101)(H,90,98)(H,91,99)(H,106,107)/t49-,50-,55-,61-,65-,66-,67-,68-,69-,70+,71+,72+/m0/s1
Reactome pathway
n/an/a>2.00E+4n/an/an/an/an/an/a
Bristol-Myers Squibb Research
Curated by ChEMBL
Assay Description
Inhibition of human CYP3A4
ACS Med Chem Lett 6: 770-5 (2015)
BindingDB Entry DOI: 10.7270/Q29P33D2
Cytochrome P450 2B6
(Homo sapiens (Human))
BDBM50112346
(CHEMBL3609325)
Show SMILES [H][C@@]12CN(C(=O)[C@@H](NC(=O)[C@H](C)NC)C(C)(C)C)[C@@]([H])(C1)C(=O)N[C@@H](Cc1ccc3ccccc3c1)C(=O)N[C@@H](Cc1ccc(OCc3cn(nn3)[C@]3([H])CN(C(=O)[C@@H](NC(=O)[C@H](C)NC)C(C)(C)C)[C@@]([H])(C3)C(=O)N[C@@H](Cc3ccc4ccccc4c3)C(=O)N[C@@H](Cc3ccc(OCCCC2)cc3)C(O)=O)cc1)NS(=O)(=O)C1CC1 |r|
Show InChI InChI=1S/C83H106N14O14S/c1-49(84-9)73(98)90-71(82(3,4)5)79(104)95-45-55-17-15-16-36-110-62-30-24-51(25-31-62)39-67(81(106)107)88-75(100)65(40-53-22-28-56-18-11-13-20-58(56)37-53)86-78(103)69-44-61(47-96(69)80(105)72(83(6,7)8)91-74(99)50(2)85-10)97-46-60(92-94-97)48-111-63-32-26-52(27-33-63)43-70(93-112(108,109)64-34-35-64)89-76(101)66(87-77(102)68(95)42-55)41-54-23-29-57-19-12-14-21-59(57)38-54/h11-14,18-33,37-38,46,49-50,55,61,64-72,84-85,93H,15-17,34-36,39-45,47-48H2,1-10H3,(H,86,103)(H,87,102)(H,88,100)(H,89,101)(H,90,98)(H,91,99)(H,106,107)/t49-,50-,55-,61-,65-,66-,67-,68-,69-,70+,71+,72+/m0/s1
n/an/a>2.00E+4n/an/an/an/an/an/a
Bristol-Myers Squibb Research
Curated by ChEMBL
Assay Description
Inhibition of human CYP2B6
ACS Med Chem Lett 6: 770-5 (2015)
BindingDB Entry DOI: 10.7270/Q29P33D2