BDBM50112390 17-bromo-19-oxa-2,5,10,12-tetraazahexacyclo[18.6.2.22,5.114,18.08,12.023,27]hentriaconta-1(27),8,10,14(31),15,17,20(28),21,23,25-decaen-3-one::CHEMBL23411
SMILES: Brc1ccc2Cn3cncc3CCN3CCN(C(=O)C3)c3cccc4ccc(Oc1c2)cc34
InChI Key: InChIKey=HCTZGNQLYBGGPK-UHFFFAOYSA-N
Data: 3 IC50
Activity Spreadsheet -- Enzyme Inhibition Constant Data from BindingDB
Found 3 hits for monomerid = 50112390
Trg + Lig
Ki
nM
ΔG°
kcal/mole
IC50
nM
Kd
nM
EC50/IC50
nM
koff
s-1
kon
M-1s-1
pHTemp
°C
Geranylgeranyl transferase type I beta subunit/Protein Farnesyltransferase (PFT)
(Homo sapiens (Human))
BDBM50112390
(17-bromo-19-oxa-2,5,10,12-tetraazahexacyclo[18.6.2...)
Show SMILES Brc1ccc2Cn3cncc3CCN3CCN(C(=O)C3)c3cccc4ccc(Oc1c2)cc34
Show InChI InChI=1S/C26H23BrN4O2/c27-23-7-4-18-12-25(23)33-21-6-5-19-2-1-3-24(22(19)13-21)31-11-10-29(16-26(31)32)9-8-20-14-28-17-30(20)15-18/h1-7,12-14,17H,8-11,15-16H2
n/an/a 161n/an/an/an/an/an/a
Merck Research Laboratories
Curated by ChEMBL
Assay Description
Displacement of radiolabeled FTI from Farnesyltransferase in v-Ha-ras-transformed Rat1 cells.
Bioorg Med Chem Lett 12: 1269-73 (2002)
BindingDB Entry DOI: 10.7270/Q2T72GSB
Protein Farnesyltransferase (PFT)
(Bos taurus (bovine))
BDBM50112390
(17-bromo-19-oxa-2,5,10,12-tetraazahexacyclo[18.6.2...)
Show SMILES Brc1ccc2Cn3cncc3CCN3CCN(C(=O)C3)c3cccc4ccc(Oc1c2)cc34
Show InChI InChI=1S/C26H23BrN4O2/c27-23-7-4-18-12-25(23)33-21-6-5-19-2-1-3-24(22(19)13-21)31-11-10-29(16-26(31)32)9-8-20-14-28-17-30(20)15-18/h1-7,12-14,17H,8-11,15-16H2
n/an/a 1.20n/an/an/an/an/an/a
Merck Research Laboratories
Curated by ChEMBL
Assay Description
Inhibition of Farnesyltransferase catalyzed incorporation of [3H]-FPP into recombinant Ras-CVIM.
Bioorg Med Chem Lett 12: 1269-73 (2002)
BindingDB Entry DOI: 10.7270/Q2T72GSB
Protein Farnesyltransferase (PFT)
(Bos taurus (bovine))
BDBM50112390
(17-bromo-19-oxa-2,5,10,12-tetraazahexacyclo[18.6.2...)
Show SMILES Brc1ccc2Cn3cncc3CCN3CCN(C(=O)C3)c3cccc4ccc(Oc1c2)cc34
Show InChI InChI=1S/C26H23BrN4O2/c27-23-7-4-18-12-25(23)33-21-6-5-19-2-1-3-24(22(19)13-21)31-11-10-29(16-26(31)32)9-8-20-14-28-17-30(20)15-18/h1-7,12-14,17H,8-11,15-16H2
n/an/a 2n/an/an/an/an/an/a
Merck Research Laboratories
Curated by ChEMBL
Assay Description
Inhibition of the human Geranylgeranyl transferase type I catalyzed incorporation of [3H]-GGPP into a biotinylated peptide corresponding to the C-ter...
Bioorg Med Chem Lett 12: 1269-73 (2002)
BindingDB Entry DOI: 10.7270/Q2T72GSB