BDBM50112633 (FITC-G-S-G-Q-W-A-V-G-H-L-M-NH2)::CHEMBL385928
SMILES: CSCCC(NC(=O)C(CC(C)C)NC(=O)C(Cc1cnc[nH]1)NC(=O)CNC(=O)C(NC(=O)C(C)NC(=O)C(Cc1c[nH]c2ccccc12)NC(=O)C(CCC(N)=O)NC(=O)CNC(=O)C(CO)NC(=O)CNC(=S)Nc1ccc2c(c1)C(=O)OC21c2ccc(O)cc2Oc2cc(O)ccc12)C(C)C)C(N)=O
InChI Key: InChIKey=NVVCKEISAFPOSI-UHFFFAOYSA-N
Data: 1 IC50
Activity Spreadsheet -- Enzyme Inhibition Constant Data from BindingDB
Found 1 hit for monomerid = 50112633
Trg + Lig
Ki
nM
ΔG°
kcal/mole
IC50
nM
Kd
nM
EC50/IC50
nM
koff
s-1
kon
M-1s-1
pHTemp
°C
Gastrin-Releasing peptide
(RAT)
BDBM50112633
((FITC-G-S-G-Q-W-A-V-G-H-L-M-NH2) | CHEMBL385928)
Show SMILES CSCCC(NC(=O)C(CC(C)C)NC(=O)C(Cc1cnc[nH]1)NC(=O)CNC(=O)C(NC(=O)C(C)NC(=O)C(Cc1c[nH]c2ccccc12)NC(=O)C(CCC(N)=O)NC(=O)CNC(=O)C(CO)NC(=O)CNC(=S)Nc1ccc2c(c1)C(=O)OC21c2ccc(O)cc2Oc2cc(O)ccc12)C(C)C)C(N)=O
Show InChI InChI=1S/C71H87N17O18S2/c1-34(2)21-50(66(101)85-48(61(73)96)19-20-108-6)86-67(102)52(24-39-28-74-33-79-39)83-58(94)30-77-68(103)60(35(3)4)88-62(97)36(5)80-65(100)51(22-37-27-75-47-10-8-7-9-42(37)47)87-64(99)49(17-18-56(72)92)82-57(93)29-76-63(98)53(32-89)84-59(95)31-78-70(107)81-38-11-14-44-43(23-38)69(104)106-71(44)45-15-12-40(90)25-54(45)105-55-26-41(91)13-16-46(55)71/h7-16,23,25-28,33-36,48-53,60,75,89-91H,17-22,24,29-32H2,1-6H3,(H2,72,92)(H2,73,96)(H,74,79)(H,76,98)(H,77,103)(H,80,100)(H,82,93)(H,83,94)(H,84,95)(H,85,101)(H,86,102)(H,87,99)(H,88,97)(H2,78,81,107)
n/an/a 9.20n/an/an/an/an/an/a
Washington University School of Medicine
Curated by ChEMBL
Assay Description
In vitro binding affinity of [111In]-DTPA-[Y4]-bombesin to bombesin receptor in the rat pancreatic acinar cell line, AR42J
J Med Chem 45: 2003-15 (2002)
BindingDB Entry DOI: 10.7270/Q2CZ36GK