BDBM50112925 (2,6-Dimethyl-phenyl)-imidazo[1,5-a]quinoxalin-4-yl-amine::CHEMBL28632::N-(2,6-dimethylphenyl)imidazo[1,5-a]quinoxalin-4-amine
SMILES: Cc1cccc(C)c1Nc1nc2ccccc2n2cncc12
InChI Key: InChIKey=IITXHDUVJMZOJD-UHFFFAOYSA-N
Data: 3 IC50
Activity Spreadsheet -- Enzyme Inhibition Constant Data from BindingDB
Found 3 hits for monomerid = 50112925
Trg + Lig
Ki
nM
ΔG°
kcal/mole
IC50
nM
Kd
nM
EC50/IC50
nM
koff
s-1
kon
M-1s-1
pHTemp
°C
Tyrosine-protein kinase Lck
(Homo sapiens (Human))
BDBM50112925
((2,6-Dimethyl-phenyl)-imidazo[1,5-a]quinoxalin-4-y...)
Show SMILES Cc1cccc(C)c1Nc1nc2ccccc2n2cncc12
Show InChI InChI=1S/C18H16N4/c1-12-6-5-7-13(2)17(12)21-18-16-10-19-11-22(16)15-9-4-3-8-14(15)20-18/h3-11H,1-2H3,(H,20,21)
n/an/a 16n/an/an/an/an/an/a
Bristol Myers Squibb Pharmaceutical Research Institute
Curated by ChEMBL
Assay Description
Inhibitory activity against recombinant p56 Lck tyrosine kinase expressed as a His-tagged protein in insect cells using a baculovirus expression syst...
Bioorg Med Chem Lett 12: 1361-4 (2002)
BindingDB Entry DOI: 10.7270/Q2R78DJ1
Tyrosine-protein kinase Lck
(Homo sapiens (Human))
BDBM50112925
((2,6-Dimethyl-phenyl)-imidazo[1,5-a]quinoxalin-4-y...)
Show SMILES Cc1cccc(C)c1Nc1nc2ccccc2n2cncc12
Show InChI InChI=1S/C18H16N4/c1-12-6-5-7-13(2)17(12)21-18-16-10-19-11-22(16)15-9-4-3-8-14(15)20-18/h3-11H,1-2H3,(H,20,21)
n/an/a 16n/an/an/an/an/an/a
University of Zurich
Curated by ChEMBL
Assay Description
Inhibition of Lck
J Med Chem 51: 1179-88 (2008)
Article DOI: 10.1021/jm070654j
BindingDB Entry DOI: 10.7270/Q29Z95RD
Tyrosine-protein kinase Lck
(Homo sapiens (Human))
BDBM50112925
((2,6-Dimethyl-phenyl)-imidazo[1,5-a]quinoxalin-4-y...)
Show SMILES Cc1cccc(C)c1Nc1nc2ccccc2n2cncc12
Show InChI InChI=1S/C18H16N4/c1-12-6-5-7-13(2)17(12)21-18-16-10-19-11-22(16)15-9-4-3-8-14(15)20-18/h3-11H,1-2H3,(H,20,21)
n/an/a 16n/an/an/an/an/an/a
Yale University
Curated by ChEMBL
Assay Description
Evaluated for inhibition of human p56 Lck tyrosine kinase
J Med Chem 47: 2534-49 (2004)
Article DOI: 10.1021/jm0304358
BindingDB Entry DOI: 10.7270/Q2KH0P3P