null
SMILES: [#6]-[#7](-[#6]-[#6]-[#8]P([#8])(=O)[#8]P([#8])([#8])=O)-[#6]-[#6]\[#6]=[#6](/[#6])-[#6]-[#6]\[#6]=[#6](/[#6])-[#6]-[#6]\[#6]=[#6](\[#6])-[#6]
InChI Key: InChIKey=OEMBPHBKZPOPBN-NWLVNBMCSA-N
PDB links: 6 PDB IDs match this monomer.
Activity Spreadsheet -- Enzyme Inhibition Constant Data from BindingDB
Found 1 hit for monomerid = 50113289
Trg + Lig
Ki
nM
ΔG°
kcal/mole
IC50
nM
Kd
nM
EC50/IC50
nM
koff
s-1
kon
M-1s-1
pHTemp
°C
Geranylgeranyl pyrophosphate synthase
(Homo sapiens (Human))
BDBM50113289
(2-[METHYL-(5-GERANYL-4-METHYL-PENT-3-ENYL)-AMINO]-...)
Show SMILES [#6]-[#7](-[#6]-[#6]-[#8]P([#8])(=O)[#8]P([#8])([#8])=O)-[#6]-[#6]\[#6]=[#6](/[#6])-[#6]-[#6]\[#6]=[#6](/[#6])-[#6]-[#6]\[#6]=[#6](\[#6])-[#6]
Show InChI InChI=1S/C19H37NO7P2/c1-17(2)9-6-10-18(3)11-7-12-19(4)13-8-14-20(5)15-16-26-29(24,25)27-28(21,22)23/h9,11,13H,6-8,10,12,14-16H2,1-5H3,(H,24,25)(H2,21,22,23)/b18-11+,19-13+
Reactome pathway
n/an/a 140n/an/an/an/an/an/a
University of Illinois at Urbana-Champaign
Curated by ChEMBL
Assay Description
Inhibitory activity against the human recombinant geranylgeranyl diphosphate synthase (GGPPSase).
J Med Chem 45: 2185-96 (2002)
BindingDB Entry DOI: 10.7270/Q2KH0MN1