BDBM50113357 CHEMBL3604492
SMILES: CC(C)(C)c1ccc(cc1)S(=O)(=O)Nc1ccc(Cl)cc1-c1ncnc(N)c1O
InChI Key: InChIKey=FRBFFLDWVHPQRO-UHFFFAOYSA-N
Data: 2 IC50
Activity Spreadsheet -- Enzyme Inhibition Constant Data from BindingDB
Found 2 hits for monomerid = 50113357
Trg + Lig
Ki
nM
ΔG°
kcal/mole
IC50
nM
Kd
nM
EC50/IC50
nM
koff
s-1
kon
M-1s-1
pHTemp
°C
C-C chemokine receptor type 9
(Homo sapiens (Human))
BDBM50113357
(CHEMBL3604492)
Show SMILES CC(C)(C)c1ccc(cc1)S(=O)(=O)Nc1ccc(Cl)cc1-c1ncnc(N)c1O
Show InChI InChI=1S/C20H21ClN4O3S/c1-20(2,3)12-4-7-14(8-5-12)29(27,28)25-16-9-6-13(21)10-15(16)17-18(26)19(22)24-11-23-17/h4-11,25-26H,1-3H3,(H2,22,23,24)
Reactome pathway
n/an/a 340n/an/an/an/an/an/a
Cubist Pharmaceuticals
Curated by ChEMBL
Assay Description
Antagonist activity at CCR9 receptor (unknown origin) by buffer chemotaxis assay
Bioorg Med Chem Lett 25: 3661-4 (2015)
BindingDB Entry DOI: 10.7270/Q2RR2123
C-C chemokine receptor type 9
(Homo sapiens (Human))
BDBM50113357
(CHEMBL3604492)
Show SMILES CC(C)(C)c1ccc(cc1)S(=O)(=O)Nc1ccc(Cl)cc1-c1ncnc(N)c1O
Show InChI InChI=1S/C20H21ClN4O3S/c1-20(2,3)12-4-7-14(8-5-12)29(27,28)25-16-9-6-13(21)10-15(16)17-18(26)19(22)24-11-23-17/h4-11,25-26H,1-3H3,(H2,22,23,24)
Reactome pathway
n/an/a 14n/an/an/an/an/an/a
Cubist Pharmaceuticals
Curated by ChEMBL
Assay Description
Antagonist activity at CCR9 receptor (unknown origin) assessed as inhibition of TECK-induced calcium mobilization incubated for 10 mins prior to TECK...
Bioorg Med Chem Lett 25: 3661-4 (2015)
BindingDB Entry DOI: 10.7270/Q2RR2123