BDBM50113359 CHEMBL3604494
SMILES: CC(C)(C)c1ccc(cc1)S(=O)(=O)Nc1ccc(Cl)cc1-c1nncc(N2CCOCC2)c1N
InChI Key: InChIKey=NHIOMLRISKSZIR-UHFFFAOYSA-N
Data: 2 IC50
Activity Spreadsheet -- Enzyme Inhibition Constant Data from BindingDB
Found 2 hits for monomerid = 50113359
Trg + Lig
Ki
nM
ΔG°
kcal/mole
IC50
nM
Kd
nM
EC50/IC50
nM
koff
s-1
kon
M-1s-1
pHTemp
°C
C-C chemokine receptor type 9
(Homo sapiens (Human))
BDBM50113359
(CHEMBL3604494)
Show SMILES CC(C)(C)c1ccc(cc1)S(=O)(=O)Nc1ccc(Cl)cc1-c1nncc(N2CCOCC2)c1N
Show InChI InChI=1S/C24H28ClN5O3S/c1-24(2,3)16-4-7-18(8-5-16)34(31,32)29-20-9-6-17(25)14-19(20)23-22(26)21(15-27-28-23)30-10-12-33-13-11-30/h4-9,14-15,29H,10-13H2,1-3H3,(H2,26,27)
Reactome pathway
n/an/a 190n/an/an/an/an/an/a
Cubist Pharmaceuticals
Curated by ChEMBL
Assay Description
Antagonist activity at CCR9 receptor (unknown origin) by buffer chemotaxis assay
Bioorg Med Chem Lett 25: 3661-4 (2015)
BindingDB Entry DOI: 10.7270/Q2RR2123
C-C chemokine receptor type 9
(Homo sapiens (Human))
BDBM50113359
(CHEMBL3604494)
Show SMILES CC(C)(C)c1ccc(cc1)S(=O)(=O)Nc1ccc(Cl)cc1-c1nncc(N2CCOCC2)c1N
Show InChI InChI=1S/C24H28ClN5O3S/c1-24(2,3)16-4-7-18(8-5-16)34(31,32)29-20-9-6-17(25)14-19(20)23-22(26)21(15-27-28-23)30-10-12-33-13-11-30/h4-9,14-15,29H,10-13H2,1-3H3,(H2,26,27)
Reactome pathway
n/an/a 26n/an/an/an/an/an/a
Cubist Pharmaceuticals
Curated by ChEMBL
Assay Description
Antagonist activity at CCR9 receptor (unknown origin) assessed as inhibition of TECK-induced calcium mobilization incubated for 10 mins prior to TECK...
Bioorg Med Chem Lett 25: 3661-4 (2015)
BindingDB Entry DOI: 10.7270/Q2RR2123