null
SMILES: NC(=O)c1cccc2CN(C3CCN(Cc4ccccc4C(F)(F)F)CC3)C(=O)c12
InChI Key: InChIKey=IIIYUFCWDAEBTQ-UHFFFAOYSA-N
Activity Spreadsheet -- Enzyme Inhibition Constant Data from BindingDB
Found 1 hit for monomerid = 50113457
Trg + Lig
Ki
nM
ΔG°
kcal/mole
IC50
nM
Kd
nM
EC50/IC50
nM
koff
s-1
kon
M-1s-1
pHTemp
°C
Poly [ADP-ribose] polymerase 1
(Homo sapiens (Human))
BDBM50113457
(CHEMBL3606002)
Show SMILES NC(=O)c1cccc2CN(C3CCN(Cc4ccccc4C(F)(F)F)CC3)C(=O)c12
Show InChI InChI=1S/C22H22F3N3O2/c23-22(24,25)18-7-2-1-4-14(18)12-27-10-8-16(9-11-27)28-13-15-5-3-6-17(20(26)29)19(15)21(28)30/h1-7,16H,8-13H2,(H2,26,29)
n/an/an/a 410n/an/an/an/an/a
Nerviano Medical Sciences Srl
Curated by ChEMBL
Assay Description
Binding affinity to full length recombinant human PARP-1 by fluorescence polarization displacement assay
J Med Chem 58: 6875-98 (2015)
BindingDB Entry DOI: 10.7270/Q2JD4ZKF