BDBM50113462 CHEMBL3605968
SMILES: COCCN1Cc2cccc(C(N)=O)c2C1=O
InChI Key: InChIKey=ZWBARJOHZLFHQL-UHFFFAOYSA-N
Data: 1 Kd
Activity Spreadsheet -- Enzyme Inhibition Constant Data from BindingDB
Found 1 hit for monomerid = 50113462
Trg + Lig
Ki
nM
ΔG°
kcal/mole
IC50
nM
Kd
nM
EC50/IC50
nM
koff
s-1
kon
M-1s-1
pHTemp
°C
Poly [ADP-ribose] polymerase 1
(Homo sapiens (Human))
BDBM50113462
(CHEMBL3605968)
Show SMILES COCCN1Cc2cccc(C(N)=O)c2C1=O
Show InChI InChI=1S/C12H14N2O3/c1-17-6-5-14-7-8-3-2-4-9(11(13)15)10(8)12(14)16/h2-4H,5-7H2,1H3,(H2,13,15)
n/an/an/a 220n/an/an/an/an/a
Nerviano Medical Sciences Srl
Curated by ChEMBL
Assay Description
Binding affinity to full length recombinant human PARP-1 by fluorescence polarization displacement assay
J Med Chem 58: 6875-98 (2015)
BindingDB Entry DOI: 10.7270/Q2JD4ZKF