null
SMILES: Cc1cc(cc(c1)-c1ccnc(c1)-n1cccn1)C#N
InChI Key: InChIKey=UNXZNHBCTMVLPT-UHFFFAOYSA-N
Activity Spreadsheet -- Enzyme Inhibition Constant Data from BindingDB
Found 2 hits for monomerid = 50113470
Trg + Lig
Ki
nM
ΔG°
kcal/mole
IC50
nM
Kd
nM
EC50/IC50
nM
koff
s-1
kon
M-1s-1
pHTemp
°C
Metabotropic glutamate receptor 5
(Homo sapiens (Human))
BDBM50113470
(CHEMBL3603917)
Show SMILES Cc1cc(cc(c1)-c1ccnc(c1)-n1cccn1)C#N
Show InChI InChI=1S/C16H12N4/c1-12-7-13(11-17)9-15(8-12)14-3-5-18-16(10-14)20-6-2-4-19-20/h2-10H,1H3
20n/an/an/an/an/an/an/an/a
Heptares Therapeutics Ltd.
Curated by ChEMBL
Assay Description
Displacement of [3H]-M-MPEP from human mGlu5 receptor expressed in HEK293 cells after 90 mins by scintillation spectroscopy analysis
J Med Chem 58: 6653-64 (2015)
BindingDB Entry DOI: 10.7270/Q2H70HMZ
Metabotropic glutamate receptor 5
(Homo sapiens (Human))
BDBM50113470
(CHEMBL3603917)
Show SMILES Cc1cc(cc(c1)-c1ccnc(c1)-n1cccn1)C#N
Show InChI InChI=1S/C16H12N4/c1-12-7-13(11-17)9-15(8-12)14-3-5-18-16(10-14)20-6-2-4-19-20/h2-10H,1H3
n/an/a 20n/an/an/an/an/an/a
Heptares Therapeutics Ltd.
Curated by ChEMBL
Assay Description
Negative allosteric modulation at human mGlu5 receptor expressed in HEK293 cells assessed as inhibition of L-quisqualic acid-induced inositol phospha...
J Med Chem 58: 6653-64 (2015)
BindingDB Entry DOI: 10.7270/Q2H70HMZ