BDBM50113698 2-[1-(6-Butylamino-9-isopropyl-9H-purin-2-yl)-piperidin-2-yl]-ethanol::CHEMBL80859
SMILES: CCCCNc1nc(nc2n(cnc12)C(C)C)N1CCCCC1CCO
InChI Key: InChIKey=NYQYYSIFCSDYGN-UHFFFAOYSA-N
Data: 1 IC50
Activity Spreadsheet -- Enzyme Inhibition Constant Data from BindingDB
Found 1 hit for monomerid = 50113698
Trg + Lig
Ki
nM
ΔG°
kcal/mole
IC50
nM
Kd
nM
EC50/IC50
nM
koff
s-1
kon
M-1s-1
pHTemp
°C
Cyclin-dependent kinase 1
(Homo sapiens (Human))
BDBM50113698
(2-[1-(6-Butylamino-9-isopropyl-9H-purin-2-yl)-pipe...)
Show SMILES CCCCNc1nc(nc2n(cnc12)C(C)C)N1CCCCC1CCO
Show InChI InChI=1S/C19H32N6O/c1-4-5-10-20-17-16-18(25(13-21-16)14(2)3)23-19(22-17)24-11-7-6-8-15(24)9-12-26/h13-15,26H,4-12H2,1-3H3,(H,20,22,23)
Reactome pathway
n/an/a 1.30E+6n/an/an/an/an/an/a
Aventis Pharma Deutschland GmbH
Curated by ChEMBL
Assay Description
Binding affinity to cyclin-dependent kinase 1 (CDK1)
J Med Chem 45: 2366-78 (2002)
BindingDB Entry DOI: 10.7270/Q25B01SB