BDBM50113980 CHEMBL3605557
SMILES: CCn1c(nc2cnc(cc12)C(F)(F)F)[C@@H](C)NS(=O)(=O)c1ccc(nc1)C#N
InChI Key: InChIKey=GAPKQSFTRWQZTL-SNVBAGLBSA-N
Data: 7 IC50  1 EC50
Activity Spreadsheet -- Enzyme Inhibition Constant Data from BindingDB
Found 8 hits for monomerid = 50113980
Trg + Lig
Ki
nM
ΔG°
kcal/mole
IC50
nM
Kd
nM
EC50/IC50
nM
koff
s-1
kon
M-1s-1
pHTemp
°C
Cytochrome P450 2D6
(Homo sapiens (Human))
BDBM50113980
(CHEMBL3605557)
Show SMILES CCn1c(nc2cnc(cc12)C(F)(F)F)[C@@H](C)NS(=O)(=O)c1ccc(nc1)C#N |r|
Show InChI InChI=1S/C17H15F3N6O2S/c1-3-26-14-6-15(17(18,19)20)23-9-13(14)24-16(26)10(2)25-29(27,28)12-5-4-11(7-21)22-8-12/h4-6,8-10,25H,3H2,1-2H3/t10-/m1/s1
n/an/a>2.00E+4n/an/an/an/an/an/a
AstraZeneca
Curated by ChEMBL
Assay Description
Inhibition of CYP2D6 in human liver microsomes incubated for 5 mins in presence of NADPH and specific substrates by LC/MS/MS method
J Med Chem 58: 7057-75 (2015)
BindingDB Entry DOI: 10.7270/Q2Z89F6J
Sphingosine 1-phosphate receptor 1
(Homo sapiens (Human))
BDBM50113980
(CHEMBL3605557)
Show SMILES CCn1c(nc2cnc(cc12)C(F)(F)F)[C@@H](C)NS(=O)(=O)c1ccc(nc1)C#N |r|
Show InChI InChI=1S/C17H15F3N6O2S/c1-3-26-14-6-15(17(18,19)20)23-9-13(14)24-16(26)10(2)25-29(27,28)12-5-4-11(7-21)22-8-12/h4-6,8-10,25H,3H2,1-2H3/t10-/m1/s1
Reactome pathway
n/an/an/an/a 7n/an/an/an/a
AstraZeneca
Curated by ChEMBL
Assay Description
Antagonist activity against human S1P1 receptor expressed in human U2OS cells co-expressing GFP assessed as inhibition of S1P-induced receptor transl...
J Med Chem 58: 7057-75 (2015)
BindingDB Entry DOI: 10.7270/Q2Z89F6J
Cytochrome P450 1A2
(Homo sapiens (Human))
BDBM50113980
(CHEMBL3605557)
Show SMILES CCn1c(nc2cnc(cc12)C(F)(F)F)[C@@H](C)NS(=O)(=O)c1ccc(nc1)C#N |r|
Show InChI InChI=1S/C17H15F3N6O2S/c1-3-26-14-6-15(17(18,19)20)23-9-13(14)24-16(26)10(2)25-29(27,28)12-5-4-11(7-21)22-8-12/h4-6,8-10,25H,3H2,1-2H3/t10-/m1/s1
Reactome pathway
n/an/a>2.00E+4n/an/an/an/an/an/a
AstraZeneca
Curated by ChEMBL
Assay Description
Inhibition of CYP1A2 in human liver microsomes incubated for 5 mins in presence of NADPH and specific substrates by LC/MS/MS method
J Med Chem 58: 7057-75 (2015)
BindingDB Entry DOI: 10.7270/Q2Z89F6J
Cytochrome P450 2C19
(Homo sapiens (Human))
BDBM50113980
(CHEMBL3605557)
Show SMILES CCn1c(nc2cnc(cc12)C(F)(F)F)[C@@H](C)NS(=O)(=O)c1ccc(nc1)C#N |r|
Show InChI InChI=1S/C17H15F3N6O2S/c1-3-26-14-6-15(17(18,19)20)23-9-13(14)24-16(26)10(2)25-29(27,28)12-5-4-11(7-21)22-8-12/h4-6,8-10,25H,3H2,1-2H3/t10-/m1/s1
Reactome pathway
n/an/a>2.00E+4n/an/an/an/an/an/a
AstraZeneca
Curated by ChEMBL
Assay Description
Inhibition of CYP2C19 in human liver microsomes incubated for 5 mins in presence of NADPH and specific substrates by LC/MS/MS method
J Med Chem 58: 7057-75 (2015)
BindingDB Entry DOI: 10.7270/Q2Z89F6J
Potassium voltage-gated channel subfamily H member 2
(Homo sapiens (Human))
BDBM50113980
(CHEMBL3605557)
Show SMILES CCn1c(nc2cnc(cc12)C(F)(F)F)[C@@H](C)NS(=O)(=O)c1ccc(nc1)C#N |r|
Show InChI InChI=1S/C17H15F3N6O2S/c1-3-26-14-6-15(17(18,19)20)23-9-13(14)24-16(26)10(2)25-29(27,28)12-5-4-11(7-21)22-8-12/h4-6,8-10,25H,3H2,1-2H3/t10-/m1/s1
Reactome pathway
n/an/a>2.00E+5n/an/an/an/an/an/a
AstraZeneca
Curated by ChEMBL
Assay Description
Inhibition of human ERG
J Med Chem 58: 7057-75 (2015)
BindingDB Entry DOI: 10.7270/Q2Z89F6J
Cytochrome P450 3A4
(Homo sapiens (Human))
BDBM50113980
(CHEMBL3605557)
Show SMILES CCn1c(nc2cnc(cc12)C(F)(F)F)[C@@H](C)NS(=O)(=O)c1ccc(nc1)C#N |r|
Show InChI InChI=1S/C17H15F3N6O2S/c1-3-26-14-6-15(17(18,19)20)23-9-13(14)24-16(26)10(2)25-29(27,28)12-5-4-11(7-21)22-8-12/h4-6,8-10,25H,3H2,1-2H3/t10-/m1/s1
Reactome pathway
n/an/a>2.00E+4n/an/an/an/an/an/a
AstraZeneca
Curated by ChEMBL
Assay Description
Inhibition of CYP3A4 in human liver microsomes incubated for 5 mins in presence of NADPH and specific substrates by LC/MS/MS method
J Med Chem 58: 7057-75 (2015)
BindingDB Entry DOI: 10.7270/Q2Z89F6J
Cytochrome P450 3A5
(Homo sapiens (Human))
BDBM50113980
(CHEMBL3605557)
Show SMILES CCn1c(nc2cnc(cc12)C(F)(F)F)[C@@H](C)NS(=O)(=O)c1ccc(nc1)C#N |r|
Show InChI InChI=1S/C17H15F3N6O2S/c1-3-26-14-6-15(17(18,19)20)23-9-13(14)24-16(26)10(2)25-29(27,28)12-5-4-11(7-21)22-8-12/h4-6,8-10,25H,3H2,1-2H3/t10-/m1/s1
n/an/a>2.00E+4n/an/an/an/an/an/a
AstraZeneca
Curated by ChEMBL
Assay Description
Inhibition of CYP3A5 in human liver microsomes incubated for 5 mins in presence of NADPH and specific substrates by LC/MS/MS method
J Med Chem 58: 7057-75 (2015)
BindingDB Entry DOI: 10.7270/Q2Z89F6J
Cytochrome P450 2C9
(Homo sapiens (Human))
BDBM50113980
(CHEMBL3605557)
Show SMILES CCn1c(nc2cnc(cc12)C(F)(F)F)[C@@H](C)NS(=O)(=O)c1ccc(nc1)C#N |r|
Show InChI InChI=1S/C17H15F3N6O2S/c1-3-26-14-6-15(17(18,19)20)23-9-13(14)24-16(26)10(2)25-29(27,28)12-5-4-11(7-21)22-8-12/h4-6,8-10,25H,3H2,1-2H3/t10-/m1/s1
Reactome pathway
n/an/a>2.00E+4n/an/an/an/an/an/a
AstraZeneca
Curated by ChEMBL
Assay Description
Inhibition of CYP2C9 in human liver microsomes incubated for 5 mins in presence of NADPH and specific substrates by LC/MS/MS method
J Med Chem 58: 7057-75 (2015)
BindingDB Entry DOI: 10.7270/Q2Z89F6J