BDBM50114071 CHEMBL3604009
SMILES: CNC(C)C(=O)c1ccc2OCCOc2c1
InChI Key: InChIKey=MRFMNGZRIIBJTB-UHFFFAOYSA-N
Data: 2 EC50
Activity Spreadsheet -- Enzyme Inhibition Constant Data from BindingDB
Found 2 hits for monomerid = 50114071
Trg + Lig
Ki
nM
ΔG°
kcal/mole
IC50
nM
Kd
nM
EC50/IC50
nM
koff
s-1
kon
M-1s-1
pHTemp
°C
Sodium-dependent serotonin transporter
(Rattus norvegicus (rat))
BDBM50114071
(CHEMBL3604009)
Show SMILES CNC(C)C(=O)c1ccc2OCCOc2c1
Show InChI InChI=1S/C12H15NO3/c1-8(13-2)12(14)9-3-4-10-11(7-9)16-6-5-15-10/h3-4,7-8,13H,5-6H2,1-2H3
n/an/an/an/a 347n/an/an/an/a
Virginia Commonwealth University
Curated by ChEMBL
Assay Description
Binding affinity to SERT in Sprague-Dawley rat brain synaptosomes assessed as induction of [3H]5-HT release by liquid scintillation counting method
Bioorg Med Chem 23: 5574-9 (2015)
BindingDB Entry DOI: 10.7270/Q2TH8PGT
Sodium-dependent dopamine transporter
(Rattus norvegicus (rat))
BDBM50114071
(CHEMBL3604009)
Show SMILES CNC(C)C(=O)c1ccc2OCCOc2c1
Show InChI InChI=1S/C12H15NO3/c1-8(13-2)12(14)9-3-4-10-11(7-9)16-6-5-15-10/h3-4,7-8,13H,5-6H2,1-2H3
Reactome pathway
n/an/an/an/a 496n/an/an/an/a
Virginia Commonwealth University
Curated by ChEMBL
Assay Description
Binding affinity to DAT in Sprague-Dawley rat brain synaptosomes assessed as induction of [3H]MPP+ release by liquid scintillation counting method
Bioorg Med Chem 23: 5574-9 (2015)
BindingDB Entry DOI: 10.7270/Q2TH8PGT