BDBM50114249 1-(5-tert-Butyl-2-methyl-2H-pyrazol-3-yl)-3-(4-p-tolyloxy-phenyl)-urea::CHEMBL39251
SMILES: Cc1ccc(Oc2ccc(NC(=O)Nc3cc(nn3C)C(C)(C)C)cc2)cc1
InChI Key: InChIKey=RVUFDOUIMAOEOV-UHFFFAOYSA-N
Data: 1 IC50
Activity Spreadsheet -- Enzyme Inhibition Constant Data from BindingDB
Found 1 hit for monomerid = 50114249
Trg + Lig
Ki
nM
ΔG°
kcal/mole
IC50
nM
Kd
nM
EC50/IC50
nM
koff
s-1
kon
M-1s-1
pHTemp
°C
Mitogen-activated protein kinase 14
(Homo sapiens (Human))
BDBM50114249
(1-(5-tert-Butyl-2-methyl-2H-pyrazol-3-yl)-3-(4-p-t...)
Show SMILES Cc1ccc(Oc2ccc(NC(=O)Nc3cc(nn3C)C(C)(C)C)cc2)cc1
Show InChI InChI=1S/C22H26N4O2/c1-15-6-10-17(11-7-15)28-18-12-8-16(9-13-18)23-21(27)24-20-14-19(22(2,3)4)25-26(20)5/h6-14H,1-5H3,(H2,23,24,27)
NCI pathway
Reactome pathway
n/an/a 160n/an/an/an/an/an/a
Bayer Research Center
Curated by ChEMBL
Assay Description
Inhibitory activity against Mitogen-activated protein kinase p38 alpha 2
Bioorg Med Chem Lett 12: 1559-62 (2002)
BindingDB Entry DOI: 10.7270/Q2CV4H28