BDBM50114404 CHEMBL3608325
SMILES: COc1cc(cc(OC)c1OC)C(=O)N\N=C\c1cc(co1)-c1cccc(c1)C(O)=O
InChI Key: InChIKey=WLJBKPJKDQJKRM-FOKLQQMPSA-N
Data: 2 IC50
Activity Spreadsheet -- Enzyme Inhibition Constant Data from BindingDB
Found 2 hits for monomerid = 50114404
Trg + Lig
Ki
nM
ΔG°
kcal/mole
IC50
nM
Kd
nM
EC50/IC50
nM
koff
s-1
kon
M-1s-1
pHTemp
°C
Lactate dehydrogenase A (LDHA)
(Homo sapiens (Human))
BDBM50114404
(CHEMBL3608325)
Show SMILES COc1cc(cc(OC)c1OC)C(=O)N\N=C\c1cc(co1)-c1cccc(c1)C(O)=O
Show InChI InChI=1S/C22H20N2O7/c1-28-18-9-15(10-19(29-2)20(18)30-3)21(25)24-23-11-17-8-16(12-31-17)13-5-4-6-14(7-13)22(26)27/h4-12H,1-3H3,(H,24,25)(H,26,27)/b23-11+
Reactome pathway
n/an/a 5.20E+4n/an/an/an/an/an/a
University of Bologna
Curated by ChEMBL
Assay Description
Inhibition of lactate dehydrogenase-A in human Raji cells assessed as reduction of intracellular lactate level after 3 hrs
Eur J Med Chem 101: 63-70 (2015)
BindingDB Entry DOI: 10.7270/Q2NS0WQM
Lactate dehydrogenase A (LDHA)
(Homo sapiens (Human))
BDBM50114404
(CHEMBL3608325)
Show SMILES COc1cc(cc(OC)c1OC)C(=O)N\N=C\c1cc(co1)-c1cccc(c1)C(O)=O
Show InChI InChI=1S/C22H20N2O7/c1-28-18-9-15(10-19(29-2)20(18)30-3)21(25)24-23-11-17-8-16(12-31-17)13-5-4-6-14(7-13)22(26)27/h4-12H,1-3H3,(H,24,25)(H,26,27)/b23-11+
Reactome pathway
n/an/a 3.20E+4n/an/an/an/an/an/a
University of Bologna
Curated by ChEMBL
Assay Description
Inhibition of human liver purified lactate dehydrogenase-A using pyruvate as substrate assessed as NADH oxidation for 3 mins by fluorimetric method
Eur J Med Chem 101: 63-70 (2015)
BindingDB Entry DOI: 10.7270/Q2NS0WQM