BDBM50114459 2'-Sulfamoyl-biphenyl-4-carboxylic acid [2-(3-carbamimidoyl-phenoxy)-4-methoxy-phenyl]-amide::CHEMBL44111
SMILES: COc1ccc(NC(=O)c2ccc(cc2)-c2ccccc2S(N)(=O)=O)c(Oc2cccc(c2)C(N)=N)c1
InChI Key: InChIKey=JUQVVUSVHGHPDA-UHFFFAOYSA-N
Data: 1 IC50
Activity Spreadsheet -- Enzyme Inhibition Constant Data from BindingDB
Found 1 hit for monomerid = 50114459
Trg + Lig
Ki
nM
ΔG°
kcal/mole
IC50
nM
Kd
nM
EC50/IC50
nM
koff
s-1
kon
M-1s-1
pHTemp
°C
Coagulation factor X
(Homo sapiens (Human))
BDBM50114459
(2'-Sulfamoyl-biphenyl-4-carboxylic acid [2-(3-carb...)
Show SMILES COc1ccc(NC(=O)c2ccc(cc2)-c2ccccc2S(N)(=O)=O)c(Oc2cccc(c2)C(N)=N)c1
Show InChI InChI=1S/C27H24N4O5S/c1-35-20-13-14-23(24(16-20)36-21-6-4-5-19(15-21)26(28)29)31-27(32)18-11-9-17(10-12-18)22-7-2-3-8-25(22)37(30,33)34/h2-16H,1H3,(H3,28,29)(H,31,32)(H2,30,33,34)
Reactome pathway
n/an/a 1.60n/an/an/an/an/an/a
Millennium Pharmaceuticals, Inc.
Curated by ChEMBL
Assay Description
Tested in vitro for the inhibitory activity against Coagulation factor Xa
Bioorg Med Chem Lett 12: 1657-61 (2002)
BindingDB Entry DOI: 10.7270/Q2R49Q2T