BDBM50114463 2'-Sulfamoyl-biphenyl-4-carboxylic acid [2-(3-carbamimidoyl-phenoxy)-5-fluoro-phenyl]-amide::CHEMBL47145
SMILES: NC(=N)c1cccc(Oc2ccc(F)cc2NC(=O)c2ccc(cc2)-c2ccccc2S(N)(=O)=O)c1
InChI Key: InChIKey=OGQRZBLGQNDTOI-UHFFFAOYSA-N
Data: 1 IC50
Activity Spreadsheet -- Enzyme Inhibition Constant Data from BindingDB
Found 1 hit for monomerid = 50114463
Trg + Lig
Ki
nM
ΔG°
kcal/mole
IC50
nM
Kd
nM
EC50/IC50
nM
koff
s-1
kon
M-1s-1
pHTemp
°C
Coagulation factor X
(Homo sapiens (Human))
BDBM50114463
(2'-Sulfamoyl-biphenyl-4-carboxylic acid [2-(3-carb...)
Show SMILES NC(=N)c1cccc(Oc2ccc(F)cc2NC(=O)c2ccc(cc2)-c2ccccc2S(N)(=O)=O)c1
Show InChI InChI=1S/C26H21FN4O4S/c27-19-12-13-23(35-20-5-3-4-18(14-20)25(28)29)22(15-19)31-26(32)17-10-8-16(9-11-17)21-6-1-2-7-24(21)36(30,33)34/h1-15H,(H3,28,29)(H,31,32)(H2,30,33,34)
Reactome pathway
n/an/a 4.5n/an/an/an/an/an/a
Millennium Pharmaceuticals, Inc.
Curated by ChEMBL
Assay Description
Tested in vitro for the inhibitory activity against Coagulation factor Xa
Bioorg Med Chem Lett 12: 1657-61 (2002)
BindingDB Entry DOI: 10.7270/Q2R49Q2T