BDBM50114474 3-{2-[1-Oxo-5-(2-sulfamoyl-phenyl)-1,3-dihydro-isoindol-2-yl]-ethoxy}-benzamidine::CHEMBL43699
SMILES: NC(=N)c1cccc(OCCN2Cc3cc(ccc3C2=O)-c2ccccc2S(N)(=O)=O)c1
InChI Key: InChIKey=JALRSCURYNQKCV-UHFFFAOYSA-N
Data: 1 IC50
Activity Spreadsheet -- Enzyme Inhibition Constant Data from BindingDB
Found 1 hit for monomerid = 50114474
Trg + Lig
Ki
nM
ΔG°
kcal/mole
IC50
nM
Kd
nM
EC50/IC50
nM
koff
s-1
kon
M-1s-1
pHTemp
°C
Coagulation factor X
(Homo sapiens (Human))
BDBM50114474
(3-{2-[1-Oxo-5-(2-sulfamoyl-phenyl)-1,3-dihydro-iso...)
Show SMILES NC(=N)c1cccc(OCCN2Cc3cc(ccc3C2=O)-c2ccccc2S(N)(=O)=O)c1
Show InChI InChI=1S/C23H22N4O4S/c24-22(25)16-4-3-5-18(13-16)31-11-10-27-14-17-12-15(8-9-20(17)23(27)28)19-6-1-2-7-21(19)32(26,29)30/h1-9,12-13H,10-11,14H2,(H3,24,25)(H2,26,29,30)
Reactome pathway
n/an/a 3.60n/an/an/an/an/an/a
Millennium Pharmaceuticals, Inc.
Curated by ChEMBL
Assay Description
Tested in vitro for the inhibitory activity against Coagulation factor Xa
Bioorg Med Chem Lett 12: 1657-61 (2002)
BindingDB Entry DOI: 10.7270/Q2R49Q2T