BDBM50114506 CHEMBL44278::Sodium; (R)-3-[(E)-2-(4-hydroxy-phenylcarbamoyl)-vinyl]-5,5,8-trioxo-7-[1-pyridin-2-yl-meth-(Z)-ylidene]-5lambda*6*-thia-1-aza-bicyclo[4.2.0]oct-2-ene-2-carboxylate
SMILES: Oc1ccc(NC(=O)\C=C\C2=C(N3[C@@H](\C(=C/c4ccccn4)C3=O)S(=O)(=O)C2)C([O-])=O)cc1
InChI Key: InChIKey=PUYYLQRODIUZAG-OCUJQVNQSA-M
Data: 2 IC50
Activity Spreadsheet -- Enzyme Inhibition Constant Data from BindingDB
Found 2 hits for monomerid = 50114506
Trg + Lig
Ki
nM
ΔG°
kcal/mole
IC50
nM
Kd
nM
EC50/IC50
nM
koff
s-1
kon
M-1s-1
pHTemp
°C
Beta-lactamase
(Escherichia coli)
BDBM50114506
(CHEMBL44278 | Sodium; (R)-3-[(E)-2-(4-hydroxy-phen...)
Show SMILES Oc1ccc(NC(=O)\C=C\C2=C(N3[C@@H](\C(=C/c4ccccn4)C3=O)S(=O)(=O)C2)C([O-])=O)cc1 |t:10|
Show InChI InChI=1S/C22H17N3O7S/c26-16-7-5-14(6-8-16)24-18(27)9-4-13-12-33(31,32)21-17(11-15-3-1-2-10-23-15)20(28)25(21)19(13)22(29)30/h1-11,21,26H,12H2,(H,24,27)(H,29,30)/p-1/b9-4+,17-11-/t21-/m1/s1
n/an/a 110n/an/an/an/an/an/a
Southern Methodist University
Curated by ChEMBL
Assay Description
Inhibitory activity against class A TEM-1 beta-lactamase
Bioorg Med Chem Lett 12: 1663-6 (2002)
BindingDB Entry DOI: 10.7270/Q2MC8ZB3
Beta-lactamase
(Enterobacter cloacae)
BDBM50114506
(CHEMBL44278 | Sodium; (R)-3-[(E)-2-(4-hydroxy-phen...)
Show SMILES Oc1ccc(NC(=O)\C=C\C2=C(N3[C@@H](\C(=C/c4ccccn4)C3=O)S(=O)(=O)C2)C([O-])=O)cc1 |t:10|
Show InChI InChI=1S/C22H17N3O7S/c26-16-7-5-14(6-8-16)24-18(27)9-4-13-12-33(31,32)21-17(11-15-3-1-2-10-23-15)20(28)25(21)19(13)22(29)30/h1-11,21,26H,12H2,(H,24,27)(H,29,30)/p-1/b9-4+,17-11-/t21-/m1/s1
n/an/a 35n/an/an/an/an/an/a
Southern Methodist University
Curated by ChEMBL
Assay Description
Inhibitory activity against Class C beta-lactamase
Bioorg Med Chem Lett 12: 1663-6 (2002)
BindingDB Entry DOI: 10.7270/Q2MC8ZB3