BDBM50114790 CHEMBL2151284
SMILES: CC(C)C[C@H](C(O)=O)c1cc(cc(c1)-c1ccc(cc1)C(F)(F)F)-c1ccc(cc1)C(F)(F)F
InChI Key: InChIKey=RQOWDDLKGBMJFX-QHCPKHFHSA-N
Data: 1 IC50
Activity Spreadsheet -- Enzyme Inhibition Constant Data from BindingDB
Found 1 hit for monomerid = 50114790
Trg + Lig
Ki
nM
ΔG°
kcal/mole
IC50
nM
Kd
nM
EC50/IC50
nM
koff
s-1
kon
M-1s-1
pHTemp
°C
Gamma-Secretase Subunit APH-1A/Gamma-Secretase Subunit PEN-2/Gamma-Secretase Subunit Presenilin-1/Gamma-secretase subunit APH-1B/Nicastrin /Presenilin 2
(Homo sapiens (Human))
BDBM50114790
(CHEMBL2151284)
Show SMILES CC(C)C[C@H](C(O)=O)c1cc(cc(c1)-c1ccc(cc1)C(F)(F)F)-c1ccc(cc1)C(F)(F)F |r|
Show InChI InChI=1S/C26H22F6O2/c1-15(2)11-23(24(33)34)20-13-18(16-3-7-21(8-4-16)25(27,28)29)12-19(14-20)17-5-9-22(10-6-17)26(30,31)32/h3-10,12-15,23H,11H2,1-2H3,(H,33,34)/t23-/m0/s1
n/an/a 200n/an/an/an/an/an/a
Merck Research Laboratories
Curated by ChEMBL
Assay Description
Modulation of gamma-secretase in human SKNBE-2 cells transfected with wild type APP assessed as inhibition of intracellular amyloid beta 42 productio...
Bioorg Med Chem Lett 25: 3495-500 (2015)
BindingDB Entry DOI: 10.7270/Q2125VFP