BDBM50114809 CHEMBL3608386
SMILES: Cc1cn(cn1)-c1ccc(cc1F)-c1cn(nn1)[C@H]1CCc2c(F)cccc2N(CC(F)(F)F)C1=O
InChI Key: InChIKey=SRZFYIWAAUXLMD-QFIPXVFZSA-N
Data: 2 IC50
Activity Spreadsheet -- Enzyme Inhibition Constant Data from BindingDB
Found 2 hits for monomerid = 50114809
Trg + Lig
Ki
nM
ΔG°
kcal/mole
IC50
nM
Kd
nM
EC50/IC50
nM
koff
s-1
kon
M-1s-1
pHTemp
°C
Gamma-Secretase Subunit APH-1A/Gamma-Secretase Subunit PEN-2/Gamma-Secretase Subunit Presenilin-1/Gamma-secretase subunit APH-1B/Nicastrin /Presenilin 2
(Homo sapiens (Human))
BDBM50114809
(CHEMBL3608386)
Show SMILES Cc1cn(cn1)-c1ccc(cc1F)-c1cn(nn1)[C@H]1CCc2c(F)cccc2N(CC(F)(F)F)C1=O |r|
Show InChI InChI=1S/C24H19F5N6O/c1-14-10-33(13-30-14)21-7-5-15(9-18(21)26)19-11-35(32-31-19)22-8-6-16-17(25)3-2-4-20(16)34(23(22)36)12-24(27,28)29/h2-5,7,9-11,13,22H,6,8,12H2,1H3/t22-/m0/s1
n/an/a 78n/an/an/an/an/an/a
Merck Research Laboratories
Curated by ChEMBL
Assay Description
Modulation of gamma-secretase in human SH-SY5Y cells overexpressing APP C-terminal fragment SPA4CT assessed as inhibition of intracellular amyloid be...
Bioorg Med Chem Lett 25: 3495-500 (2015)
BindingDB Entry DOI: 10.7270/Q2125VFP
Gamma-Secretase Subunit APH-1A/Gamma-Secretase Subunit PEN-2/Gamma-Secretase Subunit Presenilin-1/Gamma-secretase subunit APH-1B/Nicastrin /Presenilin 2
(Homo sapiens (Human))
BDBM50114809
(CHEMBL3608386)
Show SMILES Cc1cn(cn1)-c1ccc(cc1F)-c1cn(nn1)[C@H]1CCc2c(F)cccc2N(CC(F)(F)F)C1=O |r|
Show InChI InChI=1S/C24H19F5N6O/c1-14-10-33(13-30-14)21-7-5-15(9-18(21)26)19-11-35(32-31-19)22-8-6-16-17(25)3-2-4-20(16)34(23(22)36)12-24(27,28)29/h2-5,7,9-11,13,22H,6,8,12H2,1H3/t22-/m0/s1
n/an/a 790n/an/an/an/an/an/a
Merck Research Laboratories
Curated by ChEMBL
Assay Description
Modulation of gamma-secretase in human SH-SY5Y cells overexpressing APP C-terminal fragment SPA4CT assessed as inhibition of intracellular amyloid be...
Bioorg Med Chem Lett 25: 3495-500 (2015)
BindingDB Entry DOI: 10.7270/Q2125VFP