BDBM50114820 8-Hydroxy-8-naphthalen-2-yl-octanoic acid hydroxyamide::CHEMBL319738::N,8-dihydroxy-8-(naphthalen-2-yl)octanamide
SMILES: ONC(=O)CCCCCCC(O)c1ccc2ccccc2c1
InChI Key: InChIKey=JWCSCYWHCCHTEF-UHFFFAOYSA-N
Data: 3 IC50
Activity Spreadsheet -- Enzyme Inhibition Constant Data from BindingDB
Found 3 hits for monomerid = 50114820
Trg + Lig
Ki
nM
ΔG°
kcal/mole
IC50
nM
Kd
nM
EC50/IC50
nM
koff
s-1
kon
M-1s-1
pHTemp
°C
Histone deacetylase 1
(Homo sapiens (Human))
BDBM50114820
(8-Hydroxy-8-naphthalen-2-yl-octanoic acid hydroxya...)
Show SMILES ONC(=O)CCCCCCC(O)c1ccc2ccccc2c1
Show InChI InChI=1S/C18H23NO3/c20-17(9-3-1-2-4-10-18(21)19-22)16-12-11-14-7-5-6-8-15(14)13-16/h5-8,11-13,17,20,22H,1-4,9-10H2,(H,19,21)
NCI pathway
Reactome pathway
n/an/a 35n/an/an/an/an/an/a
MethylGene Inc.
Curated by ChEMBL
Assay Description
Inhibition against partially purified human histone deacetylase 1 (HDAC-1)
J Med Chem 45: 2877-85 (2002)
BindingDB Entry DOI: 10.7270/Q29W0DT3
Histone deacetylase 1
(Homo sapiens (Human))
BDBM50114820
(8-Hydroxy-8-naphthalen-2-yl-octanoic acid hydroxya...)
Show SMILES ONC(=O)CCCCCCC(O)c1ccc2ccccc2c1
Show InChI InChI=1S/C18H23NO3/c20-17(9-3-1-2-4-10-18(21)19-22)16-12-11-14-7-5-6-8-15(14)13-16/h5-8,11-13,17,20,22H,1-4,9-10H2,(H,19,21)
NCI pathway
Reactome pathway
n/an/a 35n/an/an/an/an/an/a
Aton Pharma, Inc
Curated by ChEMBL
Assay Description
Inhibitory concentration against recombinant human Histone deacetylase 1
J Med Chem 46: 5097-116 (2003)
Article DOI: 10.1021/jm0303094
BindingDB Entry DOI: 10.7270/Q2MP5413
Histone deacetylase 1
(Homo sapiens (Human))
BDBM50114820
(8-Hydroxy-8-naphthalen-2-yl-octanoic acid hydroxya...)
Show SMILES ONC(=O)CCCCCCC(O)c1ccc2ccccc2c1
Show InChI InChI=1S/C18H23NO3/c20-17(9-3-1-2-4-10-18(21)19-22)16-12-11-14-7-5-6-8-15(14)13-16/h5-8,11-13,17,20,22H,1-4,9-10H2,(H,19,21)
NCI pathway
Reactome pathway
n/an/a 35n/an/an/an/an/an/a
China Pharmaceutical University
Curated by ChEMBL
Assay Description
Inhibition of human HDAC1
Eur J Med Chem 44: 2868-76 (2009)
Article DOI: 10.1016/j.ejmech.2008.12.008
BindingDB Entry DOI: 10.7270/Q2HM58HD