BDBM50114821 8-Oxo-8-(4-piperidin-1-yl-phenyl)-octanoic acid hydroxyamide::CHEMBL99877::N-hydroxy-8-oxo-8-(4-(piperidin-1-yl)phenyl)octanamide
SMILES: ONC(=O)CCCCCCC(=O)c1ccc(cc1)N1CCCCC1
InChI Key: InChIKey=UWIMTTJMTWCWDP-UHFFFAOYSA-N
Data: 2 IC50
Activity Spreadsheet -- Enzyme Inhibition Constant Data from BindingDB
Found 2 hits for monomerid = 50114821
Trg + Lig
Ki
nM
ΔG°
kcal/mole
IC50
nM
Kd
nM
EC50/IC50
nM
koff
s-1
kon
M-1s-1
pHTemp
°C
Histone deacetylase 1
(Homo sapiens (Human))
BDBM50114821
(8-Oxo-8-(4-piperidin-1-yl-phenyl)-octanoic acid hy...)
Show SMILES ONC(=O)CCCCCCC(=O)c1ccc(cc1)N1CCCCC1
Show InChI InChI=1S/C19H28N2O3/c22-18(8-4-1-2-5-9-19(23)20-24)16-10-12-17(13-11-16)21-14-6-3-7-15-21/h10-13,24H,1-9,14-15H2,(H,20,23)
NCI pathway
Reactome pathway
n/an/a 9.5n/an/an/an/an/an/a
China Pharmaceutical University
Curated by ChEMBL
Assay Description
Inhibition of human HDAC1
Eur J Med Chem 44: 2868-76 (2009)
Article DOI: 10.1016/j.ejmech.2008.12.008
BindingDB Entry DOI: 10.7270/Q2HM58HD
Histone deacetylase 1
(Homo sapiens (Human))
BDBM50114821
(8-Oxo-8-(4-piperidin-1-yl-phenyl)-octanoic acid hy...)
Show SMILES ONC(=O)CCCCCCC(=O)c1ccc(cc1)N1CCCCC1
Show InChI InChI=1S/C19H28N2O3/c22-18(8-4-1-2-5-9-19(23)20-24)16-10-12-17(13-11-16)21-14-6-3-7-15-21/h10-13,24H,1-9,14-15H2,(H,20,23)
NCI pathway
Reactome pathway
n/an/a 9.5n/an/an/an/an/an/a
MethylGene Inc.
Curated by ChEMBL
Assay Description
Inhibition against partially purified human histone deacetylase 1 (HDAC-1)
J Med Chem 45: 2877-85 (2002)
BindingDB Entry DOI: 10.7270/Q29W0DT3