BDBM50115181 3-Hydroxy-3-(3-{2-[4-(3-o-tolyl-ureido)-phenyl]-acetylamino}-phenyl)-propionic acid::CHEMBL103502
SMILES: Cc1ccccc1NC(=O)Nc1ccc(CC(=O)Nc2cccc(c2)C(O)CC(O)=O)cc1
InChI Key: InChIKey=MRJJMYJMXUSYKQ-UHFFFAOYSA-N
Data: 1 IC50
Activity Spreadsheet -- Enzyme Inhibition Constant Data from BindingDB
Found 1 hit for monomerid = 50115181
Trg + Lig
Ki
nM
ΔG°
kcal/mole
IC50
nM
Kd
nM
EC50/IC50
nM
koff
s-1
kon
M-1s-1
pHTemp
°C
Fibronectin receptor beta/Integrin alpha-4
(Homo sapiens (Human))
BDBM50115181
(3-Hydroxy-3-(3-{2-[4-(3-o-tolyl-ureido)-phenyl]-ac...)
Show SMILES Cc1ccccc1NC(=O)Nc1ccc(CC(=O)Nc2cccc(c2)C(O)CC(O)=O)cc1
Show InChI InChI=1S/C25H25N3O5/c1-16-5-2-3-8-21(16)28-25(33)27-19-11-9-17(10-12-19)13-23(30)26-20-7-4-6-18(14-20)22(29)15-24(31)32/h2-12,14,22,29H,13,15H2,1H3,(H,26,30)(H,31,32)(H2,27,28,33)
Reactome pathway
n/an/a 2.00E+3n/an/an/an/an/an/a
Biogen Inc.
Curated by ChEMBL
Assay Description
Inhibition of Very late antigen 4 (VLA-4) and VCAM-Ig fusion protein interaction
J Med Chem 45: 2988-93 (2002)
BindingDB Entry DOI: 10.7270/Q24J0GDJ