BDBM50115186 3-(4-{2-[4-(3-o-Tolyl-ureido)-phenyl]-acetylamino}-phenyl)-butyric acid::CHEMBL103432
SMILES: CC(CC(O)=O)c1ccc(NC(=O)Cc2ccc(NC(=O)Nc3ccccc3C)cc2)cc1
InChI Key: InChIKey=CQECYVMYMPYNBF-UHFFFAOYSA-N
Data: 1 IC50
Activity Spreadsheet -- Enzyme Inhibition Constant Data from BindingDB
Found 1 hit for monomerid = 50115186
Trg + Lig
Ki
nM
ΔG°
kcal/mole
IC50
nM
Kd
nM
EC50/IC50
nM
koff
s-1
kon
M-1s-1
pHTemp
°C
Fibronectin receptor beta/Integrin alpha-4
(Homo sapiens (Human))
BDBM50115186
(3-(4-{2-[4-(3-o-Tolyl-ureido)-phenyl]-acetylamino}...)
Show SMILES CC(CC(O)=O)c1ccc(NC(=O)Cc2ccc(NC(=O)Nc3ccccc3C)cc2)cc1
Show InChI InChI=1S/C26H27N3O4/c1-17-5-3-4-6-23(17)29-26(33)28-22-11-7-19(8-12-22)16-24(30)27-21-13-9-20(10-14-21)18(2)15-25(31)32/h3-14,18H,15-16H2,1-2H3,(H,27,30)(H,31,32)(H2,28,29,33)
Reactome pathway
n/an/a 1.30n/an/an/an/an/an/a
Biogen Inc.
Curated by ChEMBL
Assay Description
Inhibition of Very late antigen 4 (VLA-4) and VCAM-Ig fusion protein interaction
J Med Chem 45: 2988-93 (2002)
BindingDB Entry DOI: 10.7270/Q24J0GDJ