BDBM50115214 CHEMBL3609007
SMILES: CN(Cc1ccccc1B(O)O)c1ncc(cn1)C(=O)Nc1ccc(F)cc1
InChI Key: InChIKey=WEQNXDBEVJEMIM-UHFFFAOYSA-N
Data: 2 IC50
Activity Spreadsheet -- Enzyme Inhibition Constant Data from BindingDB
Found 2 hits for monomerid = 50115214
Trg + Lig
Ki
nM
ΔG°
kcal/mole
IC50
nM
Kd
nM
EC50/IC50
nM
koff
s-1
kon
M-1s-1
pHTemp
°C
C-X-C chemokine receptor type 1
(Homo sapiens (Human))
BDBM50115214
(CHEMBL3609007)
Show SMILES CN(Cc1ccccc1B(O)O)c1ncc(cn1)C(=O)Nc1ccc(F)cc1
Show InChI InChI=1S/C19H18BFN4O3/c1-25(12-13-4-2-3-5-17(13)20(27)28)19-22-10-14(11-23-19)18(26)24-16-8-6-15(21)7-9-16/h2-11,27-28H,12H2,1H3,(H,24,26)
n/an/a>5.00E+3n/an/an/an/an/an/a
Syntrix Biosystems
Curated by ChEMBL
Assay Description
Antagonist activity at CXCR1 (unknown origin) transfected in RBL cells assessed as inhibition of IL-8-mediated intracellular calcium release preincub...
Bioorg Med Chem Lett 25: 3793-7 (2015)
BindingDB Entry DOI: 10.7270/Q2V989VF
C-X-C chemokine receptor type 2
(Homo sapiens (Human))
BDBM50115214
(CHEMBL3609007)
Show SMILES CN(Cc1ccccc1B(O)O)c1ncc(cn1)C(=O)Nc1ccc(F)cc1
Show InChI InChI=1S/C19H18BFN4O3/c1-25(12-13-4-2-3-5-17(13)20(27)28)19-22-10-14(11-23-19)18(26)24-16-8-6-15(21)7-9-16/h2-11,27-28H,12H2,1H3,(H,24,26)
Reactome pathway
n/an/a>5.00E+3n/an/an/an/an/an/a
Syntrix Biosystems
Curated by ChEMBL
Assay Description
Antagonist activity at CXCR2 (unknown origin) transfected in RBL cells assessed as inhibition of IL-8-mediated intracellular calcium release preincub...
Bioorg Med Chem Lett 25: 3793-7 (2015)
BindingDB Entry DOI: 10.7270/Q2V989VF