null
SMILES: [#6]-c1ccnc2-[#6]-[#6](-[#6]-[#6](=[#7]\[#7]=[#6](\[#7])-[#7])-c12)-c1ccccc1F
InChI Key: InChIKey=LJRQWVFVUKUWRL-UHFFFAOYSA-N
Activity Spreadsheet -- Enzyme Inhibition Constant Data from BindingDB
Found 1 hit for monomerid = 50115233
Trg + Lig
Ki
nM
ΔG°
kcal/mole
IC50
nM
Kd
nM
EC50/IC50
nM
koff
s-1
kon
M-1s-1
pHTemp
°C
Sodium/hydrogen exchanger 1
(Rattus norvegicus)
BDBM50115233
(CHEMBL541577 | N-[7-(2-fluorophenyl)-4-methyl-5,6,...)
Show SMILES [#6]-c1ccnc2-[#6]-[#6](-[#6]-[#6](=[#7]\[#7]=[#6](\[#7])-[#7])-c12)-c1ccccc1F |w:10.10|
Show InChI InChI=1S/C17H18FN5/c1-10-6-7-21-14-8-11(12-4-2-3-5-13(12)18)9-15(16(10)14)22-23-17(19)20/h2-7,11H,8-9H2,1H3,(H4,19,20,23)
Reactome pathway
n/an/a 32n/an/an/an/an/an/a
Takeda Chemical Industries, Ltd.
Curated by ChEMBL
Assay Description
In vitro inhibition of acid induced swelling in rat platelets by 50% as a measure of NHE-1 inhibition
J Med Chem 45: 3009-21 (2002)
BindingDB Entry DOI: 10.7270/Q2V40VZN