BDBM50115303 4-(6,7-Dimethoxy-quinazolin-4-yl)-piperazine-1-carboxylic acid phenylamide::CHEMBL316770
SMILES: COc1cc2ncnc(N3CCN(CC3)C(=O)Nc3ccccc3)c2cc1OC
InChI Key: InChIKey=IOBJUORGEFFXQH-UHFFFAOYSA-N
Data: 1 IC50
Activity Spreadsheet -- Enzyme Inhibition Constant Data from BindingDB
Found 1 hit for monomerid = 50115303
Trg + Lig
Ki
nM
ΔG°
kcal/mole
IC50
nM
Kd
nM
EC50/IC50
nM
koff
s-1
kon
M-1s-1
pHTemp
°C
Platelet-derived growth factor receptor beta
(Homo sapiens (Human))
BDBM50115303
(4-(6,7-Dimethoxy-quinazolin-4-yl)-piperazine-1-car...)
Show SMILES COc1cc2ncnc(N3CCN(CC3)C(=O)Nc3ccccc3)c2cc1OC
Show InChI InChI=1S/C21H23N5O3/c1-28-18-12-16-17(13-19(18)29-2)22-14-23-20(16)25-8-10-26(11-9-25)21(27)24-15-6-4-3-5-7-15/h3-7,12-14H,8-11H2,1-2H3,(H,24,27)
NCI pathway
Reactome pathway
n/an/a 1.11E+4n/an/an/an/an/an/a
Pharmaceutical Research Institute
Curated by ChEMBL
Assay Description
Inhibition of Platelet-derived growth factor receptor beta phosphorylation
J Med Chem 45: 3057-66 (2002)
BindingDB Entry DOI: 10.7270/Q2RX9BDP