BDBM50115321 4-(6,7-Dimethoxy-quinazolin-4-yl)-piperazine-1-carbothioic acid (2-nitro-phenyl)-amide::CHEMBL102383
SMILES: COc1cc2ncnc(N3CCN(CC3)C(=[SH+])[N-]c3ccccc3[N+]([O-])=O)c2cc1OC
InChI Key: InChIKey=USEZBMSGJKKYDN-UHFFFAOYSA-N
Data: 1 IC50
Activity Spreadsheet -- Enzyme Inhibition Constant Data from BindingDB
Found 1 hit for monomerid = 50115321
Trg + Lig
Ki
nM
ΔG°
kcal/mole
IC50
nM
Kd
nM
EC50/IC50
nM
koff
s-1
kon
M-1s-1
pHTemp
°C
Platelet-derived growth factor receptor beta
(Homo sapiens (Human))
BDBM50115321
(4-(6,7-Dimethoxy-quinazolin-4-yl)-piperazine-1-car...)
Show SMILES COc1cc2ncnc(N3CCN(CC3)C(=[SH+])[N-]c3ccccc3[N+]([O-])=O)c2cc1OC
Show InChI InChI=1S/C21H22N6O4S/c1-30-18-11-14-16(12-19(18)31-2)22-13-23-20(14)25-7-9-26(10-8-25)21(32)24-15-5-3-4-6-17(15)27(28)29/h3-6,11-13H,7-10H2,1-2H3,(H,24,32)
NCI pathway
Reactome pathway
n/an/a 1.24E+3n/an/an/an/an/an/a
Pharmaceutical Research Institute
Curated by ChEMBL
Assay Description
Inhibition of Platelet-derived growth factor receptor beta phosphorylation
J Med Chem 45: 3057-66 (2002)
BindingDB Entry DOI: 10.7270/Q2RX9BDP